{"text_format":"1","workbook":"xlsx","n_sheets":5,"sheets":["Solicitud","Cotizacion","CSV","Datos","Listas"],"not_rendered":{"charts":0,"images":7,"macros":1,"external_links":1,"defined_names":11,"comments":0,"pivot_tables":0},"unopened":[],"bounds":{"document_bytes":16777216,"sheet_cells":100000,"rows_first":2000,"rows_last":500,"rows_between":2000,"halvings":0,"cell_chars":16384,"cell_head_chars":4096},"cells_cut":0,"cells_raw":0,"read":"whole","date_system":"1900"}

{"sheet":"Solicitud","index":0,"n_rows":48,"n_cols":14,"rows_kept":48,"cut":false,"hidden":false,"merged":[[25,1,25,13],[27,1,35,13],[23,1,23,2],[23,3,23,4],[21,1,21,2],[21,3,21,4],[21,5,23,13],[37,1,37,13],[39,1,40,13],[47,8,47,9],[47,5,47,7],[42,8,42,9],[43,8,43,9],[42,2,42,7],[43,2,43,7],[44,2,44,7],[44,8,44,9],[45,2,45,7],[45,8,45,9],[0,1,1,13],[4,1,4,13],[6,1,6,2],[6,11,6,13],[8,1,8,2],[6,3,6,9],[8,3,8,9],[2,1,2,13],[8,11,8,13],[19,1,19,13],[12,3,12,9],[12,1,12,2],[10,11,10,12],[14,1,14,13],[10,3,10,9],[10,1,10,2],[16,1,16,2],[16,3,16,4],[16,11,16,12],[16,5,16,6],[16,7,16,8],[16,9,16,10]]}
[null,"Solicitud de Cotización"]
[]
[null,"Acuerdo Marco de Precios suministro de Tiquetes Aéreos"]
[null,"Version: 3","2019-04-22"]
[null,"Información de la Entidad Compradora"]
[]
[null,"Nombre de la Entidad:",null,"Universidad Distrital Francisco José de Caldas",null,null,null,null,null,null,"NIT:","899999230-7"]
["r"]
[null,"Dirección de la Entidad:",null,"Cra 7#40b-53",null,null,null,null,null,null,"Municipio:","Bogotá D.C."]
[]
[null,"Nombre del Comprador:",null,"Eduard Arnulfo Pinilla Rivera",null,null,null,null,null,null,"Teléfono",3239300,null,"1802-1804"]
[]
[null,"Correo del comprador",null,"vicerrecadmin@udistrital.edu.co"]
[]
[null,"Fechas estimadas"]
[]
[null,"Fecha creación solicitud cotización",null,"2019-05-17",null,"Fecha generación OC",null,"2019-05-28",null,"Fecha vencimiento OC",null,"2020-05-28"]
[]
[]
[null,"Presupuesto"]
[]
[null,"Presupuesto de la Entidad",null,611587034,null,"Recuerde, la TRM es convertida a pesos colombianos así: (i) para Solicitudes enviadas entre el primero y el 15 de cada mes, la TRM es la de cierre del último día calendario del mes anterior; y (ii) para Solicitudes enviadas entre el 16 y el último día de cada mes la TRM es la del cierre del día 15 del mismo mes según lo establecido en la página de la Superintendencia Financiera de Colombia"]
[]
[null,"TRM",null,3285.14]
[null,null,null,"Digite el valor sin puntos"]
[null,"Convenios "]
[]
[null,"Convenio No. 29167-2017- Avianca (Acumulación de Millas)- Convenio LATAM Ahorro- Código UQQKJ76V (Clase N y S (15% Nacional e Internacional), Clase X, V, L, M, K, H, B, Y (18% Nacional e Internacional)"]
[]
[]
[]
[]
[]
[]
[]
[]
[]
[null,"Gravámenes adicionales (estampillas)*"]
[]
[null,"Si los hay, indique los gravámenes adicionales (estampillas) a los que está sujeta la Orden de Compra. Son gravámenes adicionales por ejemplo; estampillas y demás impuestos territoriales. Los impuestos como ICA y retención en la fuente NO son gravámenes adicionales."]
[]
[]
[null,"No.","Descripción ",null,null,null,null,null,"% Gravamen"]
[null,1,"Estampilla \"Universidad Distrital Francisco José de Caldas\"- 50 Años",null,null,null,null,null,1.0999999999999999E-2]
[null,2,"Estampilla Pro Adulto Mayor ",null,null,null,null,null,0.02]
[null,3,"Estampilla Pro Cultura ",null,null,null,null,null,5.0000000000000001E-3]
[]
[null,null,null,null,null,"Total Gravámenes adicionales",null,null,{"$f":"SUM(I44:I46)","v":3.5999999999999997E-2}]

{"sheet":"Cotizacion","index":1,"n_rows":71,"n_cols":15,"rows_kept":71,"cut":false,"hidden":false,"merged":[[16,9,16,10],[60,8,60,9],[70,3,70,13],[23,10,23,13],[68,3,68,13],[69,3,69,13],[37,1,37,13],[38,1,38,10],[39,1,39,10],[40,1,40,10],[43,1,43,10],[42,1,42,13],[44,1,44,10],[45,1,45,10],[46,1,46,10],[47,1,47,10],[6,3,6,9],[50,8,50,12],[25,1,25,13],[12,3,12,9],[23,3,23,4],[19,1,19,13],[21,1,21,2],[21,3,21,4],[21,5,21,6],[21,8,21,9],[21,12,21,13],[14,1,14,13],[16,1,16,2],[16,3,16,4],[16,5,16,6],[16,7,16,8],[10,11,10,12],[16,11,16,12],[27,1,35,13],[23,8,23,9],[0,1,1,13],[4,1,4,13],[8,1,8,2],[8,3,8,9],[8,11,8,13],[23,1,23,2],[12,1,12,2],[2,1,2,13],[10,1,10,2],[10,3,10,9],[6,1,6,2],[6,11,6,13],[58,2,58,7],[58,8,58,9],[52,1,52,13],[54,1,55,13],[57,2,57,7],[57,8,57,9],[59,2,59,7],[59,8,59,9],[60,2,60,7],[62,5,62,7],[62,8,62,9]]}
[null,"Solicitud de Cotización"]
[]
[null,"Acuerdo Marco de Precios suministro de Tiquetes Aéreos"]
[null,{"$f":"Solicitud!B4","v":"Version: 3"},{"$f":"Solicitud!C4","v":"2019-04-22"}]
[null,"Información de la Entidad Compradora"]
[]
[null,"Nombre de la Entidad:",null,"Universidad Distrital Francisco José de Caldas",null,null,null,null,null,null,"NIT:","899999230-7"]
[]
[null,"Dirección de la Entidad:",null,"Cra 7#40b-53",null,null,null,null,null,null,"Municipio:","Bogotá D.C."]
[]
[null,"Nombre del Comprador:",null,"Eduard Arnulfo Pinilla Rivera",null,null,null,null,null,null,"Teléfono",3239300,null,"1802-1804"]
[]
[null,"Correo del comprador",null,"vicerrecadmin@udistrital.edu.co"]
[]
[null,"Fechas estimadas"]
[]
[null,"Fecha creación solicitud cotización",null,"2019-05-17",null,"Fecha generación OC",null,"2019-05-28",null,"Fecha vencimiento OC",null,"2020-05-28"]
[]
[]
[null,"Presupuesto"]
[]
[null,"Presupuesto de la Entidad",null,611587034]
[]
[null,"TRM",null,3285.14,null,null,null,null,"Proveedor",null,"Viaja por el Mundo Web Nickisix 360 S.A.S."]
[]
[null,"Convenios "]
[]
[null,"Convenio No. 29167-2017- Avianca (Acumulación de Millas)- Convenio LATAM Ahorro- Código UQQKJ76V (Clase N y S (15% Nacional e Internacional), Clase X, V, L, M, K, H, B, Y (18% Nacional e Internacional)"]
[]
[]
[]
[]
[]
[]
[]
[]
[]
[null,"Tarifa Adminitrativa Nacional "]
[null,"Tarifa",null,null,null,null,null,null,null,null,null,"Valor Techo","Valor Cotizacion","Valor Total Pesos"]
[null,"Tarifa Administrativa Nacional One Way",null,null,null,null,null,null,null,null,null,{"$f":"VLOOKUP($K$24,Datos!$A$2:$G$11,MATCH(Cotizacion!$B40,Datos!$A$1:$G$1,0),0)","v":13500},7500,{"$f":"M40","v":7500},0.41670000000000001]
[null,"Tarifa Administrativa Nacional Round Trip",null,null,null,null,null,null,null,null,null,{"$f":"VLOOKUP($K$24,Datos!$A$2:$G$11,MATCH(Cotizacion!$B41,Datos!$A$1:$G$1,0),0)","v":25615},15000,{"$f":"M41","v":15000},0.41670000000000001]
[]
[null,"Los precios de las Tarifas Administrativas internacionales estan expresado en dólares americanos "]
[null,"Tarifa",null,null,null,null,null,null,null,null,null,"Valor Techo","Valor Cotizacion","Valor Total Pesos"]
[null,"Tarifa Administrativa Internacional Tiquetes Aéreos menores o iguales a USD$354",null,null,null,null,null,null,null,null,null,{"$f":"VLOOKUP($K$24,Datos!$A$2:$G$11,MATCH(Cotizacion!$B45,Datos!$A$1:$G$1,0),0)","v":9},4,{"$f":"M45*$D$24","v":13140.56},4.1700000000000001E-2]
[null,"Tarifa Administrativa Internacional Tiquetes Aéreos mayores a US$354 hasta USD$590",null,null,null,null,null,null,null,null,null,{"$f":"VLOOKUP($K$24,Datos!$A$2:$G$11,MATCH(Cotizacion!$B46,Datos!$A$1:$G$1,0),0)","v":18},0.03,{"$f":"M46*$D$24","v":98.554199999999994},4.1700000000000001E-2]
[null,"Tarifa Administrativa Internacional Tiquetes Aéreos mayores a USD$590 hasta USD$944",null,null,null,null,null,null,null,null,null,{"$f":"VLOOKUP($K$24,Datos!$A$2:$G$11,MATCH(Cotizacion!$B47,Datos!$A$1:$G$1,0),0)","v":31},0.03,98.554199999999994,4.1700000000000001E-2]
[null,"Tarifa Administrativa Internacional Tiquetes Aéreos mayores a USD$944",null,null,null,null,null,null,null,null,null,{"$f":"VLOOKUP($K$24,Datos!$A$2:$G$11,MATCH(Cotizacion!$B48,Datos!$A$1:$G$1,0),0)","v":62},0.03,98.554199999999994,4.1700000000000001E-2]
[]
[]
[null,null,null,null,null,null,null,null,"Tarifa Administrativa Ponderada",null,null,null,null,{"$f":"(N40*O40)+(N41*O41)+(N45*O45)+(N46*O46)+(N47*O47)+(N48*O48)","v":9936.0404824199977}]
[]
[null,"Gravámenes adicionales (estampillas)*"]
[]
[null,"Si los hay, indique los gravámenes adicionales (estampillas) a los que está sujeta la Orden de Compra. Son gravámenes adicionales por ejemplo; estampillas y demás impuestos territoriales. Los impuestos como ICA y retención en la fuente NO son gravámenes adicionales."]
[]
[]
[null,"No.","Descripción ",null,null,null,null,null,"% Gravamen"]
[null,1,"Estampilla \"Universidad Distrital Francisco José de Caldas\"- 50 Años",null,null,null,null,null,1.0999999999999999E-2]
[null,2,"Estampilla Pro Adulto Mayor ",null,null,null,null,null,0.02]
[null,3,"Estampilla Pro Cultura ",null,null,null,null,null,5.0000000000000001E-3]
[]
[null,null,null,null,null,"Total Gravámenes adicionales",null,null,{"$f":"SUM(I59:I61)","v":3.5999999999999997E-2}]
[]
[]
[]
[]
[]
[null,null,null,"Es la Tarifa Administrativa ponderada para el suministro de Tiquetes Aéreos."]
[null,null,null,"Es cada una de las Tarifas Administrativas ofrecida por el Proveedor. Las Tarifas Administrativas Internacionales son convertidas a pesos colombianos Con la TRM promedio de la semana anterior, publicada por Colombia Compra Eficiente semanalmente en el Minisitio del Acuerdo Marco.   "]
[null,null,null,"Es el factor de ponderación de cada una de las Tarifas Administrativas ofrecidas por el Proveedor de acuerdo con la siguiente tabla:"]

{"sheet":"CSV","index":2,"n_rows":2,"n_cols":8,"rows_kept":2,"cut":false,"hidden":true,"merged":[]}
["Tipo (servicio o artÃ­culo)","Cantidad","CÃ³digo de unidad de medida*","PosiciÃ³n","Precio base","Divisa","DescripciÃ³n","MercancÃ­a"]
["item",1,"Und",null,"\"611587034\"","COP","tqa02--Presupuesto"]

{"sheet":"Datos","index":3,"n_rows":11,"n_cols":7,"rows_kept":11,"cut":false,"hidden":true,"merged":[]}
["Proveedor ","Tarifa Administrativa Nacional One Way","Tarifa Administrativa Nacional Round Trip","Tarifa Administrativa Internacional Tiquetes Aéreos menores o iguales a USD$354","Tarifa Administrativa Internacional Tiquetes Aéreos mayores a US$354 hasta USD$590","Tarifa Administrativa Internacional Tiquetes Aéreos mayores a USD$590 hasta USD$944","Tarifa Administrativa Internacional Tiquetes Aéreos mayores a USD$944"]
["Pubblica S.A.S.",20436,35035,10,17,29,59]
["Union Temporal Novatours - Vision Tours 05 - 2018",21100,42500,11,14,30,82]
["Escobar Ospina S.A.S.",18000,30000,9,18,27,42]
["Festivaltours S.A.S.",27300,44000,13,25,41,85]
["Viaja por el Mundo Web Nickisix 360 S.A.S.",13500,25615,9,18,31,62]
["Aeroviajes Pacifico de Bogotá S.A.",15000,30000,8,15,20,38]
["Viajes Tour Colombia S.A.S.",26400,47700,13,24,40,83]
["Subatours S.A.S.",26760,49813,13,26,44,91]
["Recio Turismo S.A. ",27500,49600,13.65,25.48,41.86,90]
["Tarifas Administrativas establecidas por la Aerocivil (Cuando hay intervención del agente del mercado) para el año 2019",30000,54500,15,28,46,95]

{"sheet":"Listas","index":4,"n_rows":10,"n_cols":1,"rows_kept":10,"cut":false,"hidden":true,"merged":[]}
["proveedores"]
["Aeroviajes Pacifico de Bogotá S.A."]
["Escobar Ospina S.A.S."]
["Festivaltours S.A.S."]
["Pubblica S.A.S."]
["Recio Turismo S.A. "]
["Subatours S.A.S."]
["Union Temporal Novatours - Vision Tours 05 - 2018"]
["Viaja por el Mundo Web Nickisix 360 S.A.S."]
["Viajes Tour Colombia S.A.S."]