{"text_format":"1","workbook":"xlsx","n_sheets":13,"sheets":["SolCotizacion","Anexo","ResumenCotizacion","Cotizacion","Consolidado","temp","Servicios","Cuadro Totales","ListaProveedores","tempProveedores","ListasAutomaticas","Parametros","CSV"],"not_rendered":{"charts":0,"images":2,"macros":1,"external_links":0,"defined_names":7,"comments":0,"pivot_tables":0},"unopened":[],"bounds":{"document_bytes":16777216,"sheet_cells":100000,"rows_first":2000,"rows_last":500,"rows_between":2000,"halvings":0,"cell_chars":16384,"cell_head_chars":4096},"cells_cut":0,"cells_raw":0,"read":"whole","date_system":"1900"}

{"sheet":"SolCotizacion","index":0,"n_rows":47,"n_cols":14,"rows_kept":47,"cut":false,"hidden":false,"merged":[[42,2,42,5],[43,2,43,5],[41,2,41,5],[27,1,27,3],[30,3,30,4],[30,5,30,6],[29,1,29,12],[31,3,31,4],[31,5,31,6],[33,3,33,4],[33,5,33,6],[32,5,32,6],[14,1,14,12],[5,11,5,12],[7,11,7,12],[9,11,9,12],[3,1,3,12],[11,1,11,3],[1,1,1,12],[5,4,5,6],[7,4,7,6],[9,4,9,6],[11,4,11,6],[21,12,22,12],[21,11,22,11],[20,1,20,3],[23,1,23,3],[16,1,16,3],[16,9,16,10],[18,5,18,7],[20,5,20,7],[21,5,22,7],[23,5,23,7],[24,1,24,3],[18,1,18,3],[21,1,22,3],[21,4,22,4],[32,3,32,4],[24,5,24,7],[18,8,18,10],[21,8,21,10],[22,8,22,10],[23,8,23,10],[24,8,24,10]]}
[]
[null,"Solicitud de Cotización\nNube Pública 3G"]
[null,null,"Versión: 10","2020-02-26"]
[null,"Información de la Entidad Compradora"]
[]
[null,"Nombre de la Entidad",null,null,"UNIVERSIDAD DISTRITAL FRANCISCO JOSÉ DE CALDAS",null,null,null,null,"NIT",null,"899999230-7"]
[]
[null,"Dirección de la Entidad",null,null,"Carrera 7 N. 40B 53",null,null,null,null,"Correo de contacto",null,"planesticud@udistrital.edu.co"]
[]
[null,"Municipio",null,null,"Bogotá D.C.",null,null,null,null,"Teléfono de contacto",null," 3239300 Ext. 6338"]
[]
[null,"Nombre funcionario Comprador",null,null,"EDUARD ARNULFO PINILLA"]
[]
[]
[null,"Solicitud de Cotización"]
[]
[null,"Tasa de intermediación",null,null,"Autogestionado",null,null,null,null,"TRM",null,3858.56]
[]
[null,"Cloud Service Provider",null,null,"Segmento","link Catálogo Productos/Servicios",null,null,"Link Calculadora",null,null,"USD","Valor"]
[]
[null,"Segm 1. Amazon",null,null,"Si","https://aws.amazon.com/es/products/",null,null,"https://calculator.s3.amazonaws.com/index.html",null,null,73738.820000000007,{"$f":"L21*$L$17","v":284525661.2992}]
[null,"Segm 2. Google",null,null,"No","https://cloud.google.com/products/",null,null,"https://cloud.google.com/products/calculator/",null,null,0,{"$f":"L22*$L$17","v":0}]
[null,null,null,null,null,null,null,null,"https://cloud.google.com/maps-platform/pricing/?hl=es"]
[null,"Segm 4. Microsoft",null,null,"No","https://azure.microsoft.com/es-mx/services/",null,null,"https://azure.microsoft.com/en-us/pricing/calculator/",null,null,0,0]
[null,"Segm 5. Oracle",null,null,"No","https://www.oracle.com/co/cloud/",null,null,"https://cloud.oracle.com/en_US/cost-estimator",null,null,0,0]
[null,"Cantidad de filas:"]
[]
[null,1]
[]
[null,"Paquete de Servicios"]
[null,"Item","Cod. Matriz","Nombre del Servicio",null,"Tipo de Servicio",null,"Característica 1","Característica 2","Capacidad","Unidad x Capacidad","Cantidad en Tiempo","Unidad x Cantidad"]
[null,1,"CO-NP-01",{"$f":"VLOOKUP($C32,Consolidado!$A:$H,2,0)","v":"Servicios en la Nube"},null,{"$f":"VLOOKUP($C32,Consolidado!$A:$H,3,0)","v":"NA"},null,{"$f":"VLOOKUP($C32,Consolidado!$A:$H,4,0)","v":"NA"},{"$f":"VLOOKUP($C32,Consolidado!$A:$H,5,0)","v":"NA"},1,{"$f":"VLOOKUP($C32,Consolidado!$A:$H,6,0)","v":"Unidad"},1,{"$f":"VLOOKUP($C32,Consolidado!$A:$H,7,0)","v":"Und"},{"$f":"C32&\" - \"&D32&\"-\"&F32&\"-\"&H32&\"-\"&I32&\"-\"&J32&\" \"&K32","v":"CO-NP-01 - Servicios en la Nube-NA-NA-NA-1 Unidad"}]
[null,2,"CO-GE-01",{"$f":"VLOOKUP($C33,Consolidado!$A:$H,2,0)","v":"Tasa de intermediación para servicios autogestionados"},null,{"$f":"VLOOKUP($C33,Consolidado!$A:$H,3,0)","v":"Servicio de Computación en la Nube"},null,{"$f":"VLOOKUP($C33,Consolidado!$A:$H,4,0)","v":"NA"},{"$f":"VLOOKUP($C33,Consolidado!$A:$H,5,0)","v":"NA"},1,{"$f":"VLOOKUP($C33,Consolidado!$A:$H,6,0)","v":"Tasa"},1,{"$f":"VLOOKUP($C33,Consolidado!$A:$H,7,0)","v":"Und"},{"$f":"C33&\" - \"&D33&\"-\"&F33&\"-\"&H33&\"-\"&I33&\"-\"&J33&\" \"&K33","v":"CO-GE-01 - Tasa de intermediación para servicios autogestionados-Servicio de Computación en la Nube-NA-NA-1 Tasa"}]
[null,3,"CO-MI-01",{"$f":"VLOOKUP($C34,Consolidado!$A:$H,2,0)","v":"Servicio de Preparación para la migración"},null,{"$f":"VLOOKUP($C34,Consolidado!$A:$H,3,0)","v":"Servicios de migración"},null,{"$f":"VLOOKUP($C34,Consolidado!$A:$H,4,0)","v":"NA"},{"$f":"VLOOKUP($C34,Consolidado!$A:$H,5,0)","v":"NA"},1,{"$f":"VLOOKUP($C34,Consolidado!$A:$H,6,0)","v":"Precio por hora"},2,{"$f":"VLOOKUP($C34,Consolidado!$A:$H,7,0)","v":"Hora"},"CO-MI-01 - Servicio de Preparación para la migración-Servicios de migración-NA-NA-1 Precio por hora"]
[null,"1. Si requiere agregue o elimine filas"]
[]
[]
[null,"Gravámenes adicionales*"]
[]
[null,"Gravámenes adicionales (estampillas)"]
[null,"No","Descripción",null,null,null,"Porcentaje"]
[null,1,"Estampilla Universidad Distrital Francisco José de Caldas 50 años ",null,null,null,1.0999999999999999E-2,"","","","","",""]
[null,2,"Estampilla Pro Adultos Mayores",null,null,null,0.02]
[null,3,"Estampilla Pro Cultura",null,null,null,5.0000000000000001E-3]
[null,null,null,null,null,"Total porcentaje:",{"$f":"ROUND(SUM(G42:G44),4)","v":3.5999999999999997E-2}]
[null,null,null,"Filas a agregar o eliminar Gravámenes:"]
[null,null,null,1]

{"sheet":"Anexo","index":1,"n_rows":26,"n_cols":3,"rows_kept":26,"cut":false,"hidden":false,"merged":[[7,1,7,2],[8,1,8,2],[9,1,9,2],[1,0,1,2],[2,0,2,2],[3,0,3,2],[4,0,4,2],[5,1,5,2],[6,1,6,2]]}
[]
["Con el objetivo de complementar el entendimiento sobre la solicitud de Servicios de Centos de Contacto , por favor diligencie la totalidad de la información que se pide a continuación."]
[]
["Tenga en cuenta que esta información es de utilidad para que el Proveedor pueda cotizar de la manera más precisa posible los servicios solicitados, por lo cual la exactitud y completitud es muy importante."]
[]
["Entidad solicitante"]
["Nit"]
["Contacto técnico"]
["Correo contacto técnico"]
["Teléfono contacto técnico"]
[]
[]
[]
["Requerimiento adicional","Descripción ","INFORMACION SUMINISTRADA POR LA ENTIDAD COMPRADORA"]
["Redireccionamiento a otros Centros de Contacto","[Si requiere / No requiere]"]
["Imagen Institucional en el Centro de Contacto","[Si requiere / No requiere] La Entidad Compradora Requiere que se disponga de la imagen institucional en las instalaciones del Centro de Contacto"]
["Area de gestión del Servicio","[Si requiere / No requiere] La Entidad Compradora requiere que se disponga de una area exclusiva para la ubicación de su personal en las instalaciones del Centro de Contacto"]
["Visita técnica","[Si requiere / No requiere] Se debe realizar visita técnica a la Entidad Compradora dado que los servicios adquiridos son in-house"]
["Información adicional de canales","La Entidad Compradora entregar la siguiente información que amplia los flujos de entrada y salida de los diferentes canales, según la operación de los ultimos seis (6) meses"]
["Traslado de Líneas teléfonicas","[Si requiere / No requiere] La Entidad Compradora indica si requiere el traslado de líneas teléfonicas , para lo cual suministra la información de las mismas"]
["TMO","La Entidad Compradora indica los TMO establecidos para la prestación del servicio"]
["item","Servicio a contratar","Especificación"]
[{"$f":"SolCotizacion!B32","v":1},{"$f":"SolCotizacion!N32","v":"CO-NP-01 - Servicios en la Nube-NA-NA-NA-1 Unidad"},"Especificaciones Técnicas de Infraestructuras de la Necesidad a Adquirir\n\n*Amazon Elastic File System (EFS): Data stored in Standard storage\n    -2 TB per month _ Funcionalidad: Espacio de almacenamiento compartido para integración de aulas virtuales, proyectado de consumo hasta 2TB\n    -1 TB per month _ Funcionalidad: Espacio de almacenamiento compartido para ambiente de prueba de integración de aulas virtuales, proyectado de consumo hasta 1TB\n\n* Amazon Simple Storage Service (S3)\n   - S3 Standard storage (40 GB per month) - Funcionalidad: Espacio de almacenamiento de interfaces de Campus Virtual (desarrollo), proyectado hasta 40GB\n\n* Amazon Route 53\n   - Hosted Zones (5) _ Funcionalidad: Servicio de gestión de dominios DNS de Planestic-UD\n   - Hosted Zones (5) _ Funcionalidad: Servicio de gestión de dominios DNS para integración de aulas\n\n*Elastic Load Balancing\n   - Application Load Balancer, Number of Application Load Balancers (5) _ Funcionalidad: Balanceador de carga para integración de aulas, estimado de por facultad\n\n*Amazon Relational Database Service -  RDS for MySQL: Pricing strategy (On-Demand Instances), Storage for each RDS instance (General Purpose SSD (gp2))\n   - Quantity (1), Storage amount (155 GB) db.t3.small 2GB de RAM (instancia reservada) _ Funcionalidad: Motor de base de datos para plataformas de Planestic-UD de pruebas\n   - Quantity (1), Storage amount (200 GB) db.r5.xlarge MySQL 200GB de disco 32GB de RAM (instancia reservada) _ Funcionalidad: Motor de base de datos para plataformas de Planestic-UD de    producción\n   - Quantity (1), Multi A-Z, Storage amount (500 GB) db.r5.xlarge 32GB de ram (instancia reservada) _ Funcionalidad: Motor de base de datos para integración de aulas\n\n* Amazon ElastiCache\n   - ( 1 instances of type Memcached Standard cache m5.large Reserved All Upfront 1yr ) (instancia reservada)  _ Funcionalidad: Servicio de Memoria Caché para escalamiento de almacenamiento\n\n* Amazon Elastic Compute Cloud - EC2: Operating system (Linux), Storage for each EC2 instance (General Purpose SSD (gp2)), Snapshot Frequency (No snapshot storage)\n   - Storage amount (50 GB),  Workload (Consistent, Number of instances: 1), Advance EC2 instance (m5.large) (instancia reservada) _ Funcionalidad: Espacio de cómputo para ambiente de desarrollo de Campus Virtual\n   - Storage amount (300 GB), Workload (Consistent, Number of instances: 2), Advance EC2 instance (m5.large) (1 instancia reservada y la otra por demanda) _ Funcionalidad: Espacios de cómputo para: ambiente de pruebas de Campus Virtual (actual),  y ambiente de producción de Campus Virtual (actual)\n   - Storage amount (30 GB), Workload (Consistent, Number of instances: 4), Advance EC2 instance (m5.large) (3 instancias reservadas y la otra por demanda) _ Funcionalidad: Espacios de cómputo para: ambiente de desarrollo de observatorio TIC, ambiente de  desarrollo de integración de aulas, ambiente de producción de mesa de ayuda y ambiente de producción de generador de certificados para plataforma EDX\n   - Storage amount (100 GB), Workload (Consistent, Number of instances: 2), Advance EC2 instance (m5.large) (las 2 instancias reservadas) _ Funcionalidad: Espacios de cómputo para:  página de semillero de investigación GEIPER y portal web de Planestic-UD.\n   - Storage amount (60 GB), Workload (Consistent, Number of instances: 2), Advance EC2 instance (m5.xlarge) (1 instancias reservadas y la otra por demanda) _ Funcionalidad: Espacios de cómputo para: ambiente de producción de aulas virtuales EDX y ambiente de pruebas de aulas virtuales EDX.\n   - Storage amount (600 GB), Snapshot Frequency (No snapshot storage), Workload (Consistent, Number of instances: 1), Advance EC2 instance (m5.2xlarge) (1 instancia reservada) _ Funcionalidad: Espacio de cómputo para aulas virtuales de la facultad de ingeniería - UDIN (actual)\n   - Storage amount (600 GB), Workload (Consistent, Number of instances: 1), Advance EC2 instance (m5.xlarge) (1 instancia reservada) _ Funcionalidad: Espacio de cómputo para aulas virtuales de programas con metodología virtual y cátedras transversales (actual)\n   - Storage amount (30 GB), workload (Consistent, Number of instances: 4), Advance EC2 instance (m5.xlarge) (las 4 instancias por demanda) _ Funcionalidad: Espacios de cómputo vinculados a balanceador de carga proyectados en la integración de aulas virtuales para soportar facultad de artes, proyectado hasta 4 instancias\n   - Storage amount (30 GB), workload (Consistent, Number of instances: 4), Advance EC2 instance (m5.xlarge) (las 4 instancias por demanda) _ Funcionalidad: Espacios de cómputo vinculados a balanceador de carga proyectados en la integración de aulas virtuales para soportar facultad de ciencias, proyectado hasta 4 instancias\n   - Storage amount (30 GB), workload (Consistent, Number of instances: 4), Advance EC2 instance (m5.xlarge) (las 4 instancias reservadas) _ Funcionalidad: Espacios de cómputo vinculados a balanceador de carga proyectados en la integración de aulas virtuales para soportar facultad de ingeniería, proyectado hasta 4 instancias\n   - Storage amount (30 GB), workload (Consistent, Number of instances: 4), Advance EC2 instance (m5.xlarge) (las 4 instancias por demanda) _ Funcionalidad: Espacios de cómputo vinculados a balanceador de carga proyectados en la integración de aulas virtuales para soportar facultad de medio ambiente, proyectado hasta 4 instancias\n   - Storage amount (30 GB), workload (Consistent, Number of instances: 4), Advance EC2 instance (m5.xlarge) (las 4 instancias por demanda) _ Funcionalidad: Espacios de cómputo vinculados a balanceador de carga proyectados en la integración de aula virtuales para soportar facultad tecnológica, proyectado hasta 4 instancias\n\n* Business support plan: First month including upfront and monthly fee Supports 24/7 phone, chat, and email access to Cloud Support Engineers for unlimited contacts, with and a response time of less than 1 hour."]
[{"$f":"SolCotizacion!B33","v":2},{"$f":"SolCotizacion!N33","v":"CO-GE-01 - Tasa de intermediación para servicios autogestionados-Servicio de Computación en la Nube-NA-NA-1 Tasa"}]
[{"$f":"SolCotizacion!#REF!","v":{"$error":"#REF!"}},{"$f":"SolCotizacion!#REF!","v":{"$error":"#REF!"}}]
[{"$f":"SolCotizacion!#REF!","v":{"$error":"#REF!"}},{"$f":"SolCotizacion!#REF!","v":{"$error":"#REF!"}}]

{"sheet":"ResumenCotizacion","index":2,"n_rows":47,"n_cols":20,"rows_kept":47,"cut":false,"hidden":false,"merged":[[29,13,29,18],[33,3,33,4],[33,5,33,6],[41,2,41,5],[42,2,42,5],[43,2,43,5],[30,3,30,4],[30,5,30,6],[31,3,31,4],[31,5,31,6],[32,3,32,4],[32,5,32,6],[24,1,24,3],[24,5,24,7],[24,8,24,10],[27,1,27,3],[29,1,29,12],[21,8,21,10],[21,11,22,11],[21,12,22,12],[22,8,22,10],[23,1,23,3],[23,5,23,7],[23,8,23,10],[20,1,20,3],[20,5,20,7],[21,1,22,3],[21,4,22,4],[21,5,22,7],[16,1,16,3],[16,9,16,10],[18,1,18,3],[18,5,18,7],[18,8,18,10],[14,1,14,12],[1,1,1,12],[5,4,5,6],[7,4,7,6],[9,4,9,6],[11,1,11,3],[11,4,11,6],[3,1,3,12],[5,11,5,12],[7,11,7,12],[9,11,9,12]]}
[]
[null,"Solicitud de Cotización\nNube Pública 2G"]
[]
[null,"Información de la Entidad Compradora"]
[]
[null,"Nombre de la Entidad",null,null,{"$f":"SolCotizacion!E6","v":"UNIVERSIDAD DISTRITAL FRANCISCO JOSÉ DE CALDAS"},null,null,null,null,"NIT",null,{"$f":"SolCotizacion!L6","v":"899999230-7"}]
[]
[null,"Dirección de la Entidad",null,null,{"$f":"SolCotizacion!E8","v":"Carrera 7 N. 40B 53"},null,null,null,null,"Correo de contacto",null,{"$f":"SolCotizacion!L8","v":"planesticud@udistrital.edu.co"}]
[]
[null,"Municipio",null,null,{"$f":"SolCotizacion!E10","v":"Bogotá D.C."},null,null,null,null,"Teléfono de contacto",null,{"$f":"SolCotizacion!L10","v":" 3239300 Ext. 6338"}]
[]
[null,"Nombre funcionario Comprador",null,null,{"$f":"SolCotizacion!E12","v":"EDUARD ARNULFO PINILLA"}]
[]
[]
[null,"Resumen de Cotización"]
[]
[null,"Tasa de intermediación",null,null,"Autogestionado",null,null,null,null,"TRM",null,3858.56]
[]
[null,"Cloud Service Provider",null,null,"Segmento","link Catálogo Productos/Servicios",null,null,"Link Calculadora",null,null,"USD","Valor"]
[]
[null,"Segm 1. Amazon",null,null,"Si","https://aws.amazon.com/es/products/",null,null,"https://calculator.s3.amazonaws.com/index.html",null,null,73738.820000000007,{"$f":"L21*$L$17","v":284525661.2992}]
[null,"Segm 2. Google",null,null,"No","https://cloud.google.com/products/",null,null,"https://cloud.google.com/products/calculator/",null,null,0,{"$f":"L22*$L$17","v":0}]
[null,null,null,null,null,null,null,null,"https://cloud.google.com/maps-platform/pricing/?hl=es"]
[null,"Segm 4. Microsoft",null,null,"No","https://azure.microsoft.com/es-mx/services/",null,null,"https://azure.microsoft.com/en-us/pricing/calculator/",null,null,0,0]
[null,"Segm 5. Oracle",null,null,"No","https://www.oracle.com/co/cloud/",null,null,"https://cloud.oracle.com/en_US/cost-estimator",null,null,0,0]
[null,"Cantidad de filas:"]
[]
[null,1]
[null,null,null,null,null,null,null,null,null,null,null,null,null,{"$f":"VLOOKUP(C33,temp!$A:$BD,53,0)","v":0.12}]
[null,"Paquete de Servicios",null,null,null,null,null,null,null,null,null,null,null,"Valores"]
[null,"Item","Cod. Matriz","Nombre del Servicio",null,"Tipo de Servicio",null,"Característica 1","Característica 2","Capacidad","Unidad x Capacidad","Cantidad en Tiempo","Unidad x Cantidad","Valor Unitario","Precio maximo autorizado","Valor X Capacidad","Precio Total","IVA","Total"]
[null,1,"CO-NP-01",{"$f":"VLOOKUP($C32,Consolidado!$A:$H,2,0)","v":"Servicios en la Nube"},null,{"$f":"VLOOKUP($C32,Consolidado!$A:$H,3,0)","v":"NA"},null,{"$f":"VLOOKUP($C32,Consolidado!$A:$H,4,0)","v":"NA"},{"$f":"VLOOKUP($C32,Consolidado!$A:$H,5,0)","v":"NA"},1,{"$f":"VLOOKUP($C32,Consolidado!$A:$H,6,0)","v":"Unidad"},1,{"$f":"VLOOKUP($C32,Consolidado!$A:$H,7,0)","v":"Und"},{"$f":"VLOOKUP(C32,temp!$A:$BD,53,0)","v":284525661.2992},{"$f":"N32/(1-(VLOOKUP(\"Total porcentaje:\",$F:$G,2,0)))","v":295151100.93278009},{"$f":"O32*J32","v":295151100.93278009},{"$f":"P32*L32","v":295151100.93278009},{"$f":"IF(VLOOKUP(C32,temp!$A:$H,8,0)=\"SI\",Q32*19%,0)","v":0},{"$f":"R32+Q32","v":295151100.93278009},{"$f":"C32&\" - \"&D32&\"-\"&F32&\"_\"&H32&\"-\"&I32&\" - \"&J32&\" \"&K32","v":"CO-NP-01 - Servicios en la Nube-NA_NA-NA - 1 Unidad"}]
[null,2,"CO-GE-01",{"$f":"VLOOKUP($C33,Consolidado!$A:$H,2,0)","v":"Tasa de intermediación para servicios autogestionados"},null,{"$f":"VLOOKUP($C33,Consolidado!$A:$H,3,0)","v":"Servicio de Computación en la Nube"},null,{"$f":"VLOOKUP($C33,Consolidado!$A:$H,4,0)","v":"NA"},{"$f":"VLOOKUP($C33,Consolidado!$A:$H,5,0)","v":"NA"},1,{"$f":"VLOOKUP($C33,Consolidado!$A:$H,6,0)","v":"Tasa"},1,{"$f":"VLOOKUP($C33,Consolidado!$A:$H,7,0)","v":"Und"},{"$f":"$N$32*$N$29","v":34143079.355903998},{"$f":"N33/(1-(VLOOKUP(\"Total porcentaje:\",$F:$G,2,0)))","v":35418132.111933611},{"$f":"O33*J33","v":35418132.111933611},{"$f":"P33*L33","v":35418132.111933611},{"$f":"IF(VLOOKUP(C33,temp!$A:$H,8,0)=\"SI\",Q33*19%,0)","v":6729445.1012673862},{"$f":"R33+Q33","v":42147577.213201001},{"$f":"C33&\" - \"&D33&\"-\"&F33&\"_\"&H33&\"-\"&I33&\" - \"&J33&\" \"&K33","v":"CO-GE-01 - Tasa de intermediación para servicios autogestionados-Servicio de Computación en la Nube_NA-NA - 1 Tasa"}]
[null,3,"CO-MI-01",{"$f":"VLOOKUP($C34,Consolidado!$A:$H,2,0)","v":"Servicio de Preparación para la migración"},null,{"$f":"VLOOKUP($C34,Consolidado!$A:$H,3,0)","v":"Servicios de migración"},null,{"$f":"VLOOKUP($C34,Consolidado!$A:$H,4,0)","v":"NA"},{"$f":"VLOOKUP($C34,Consolidado!$A:$H,5,0)","v":"NA"},1,{"$f":"VLOOKUP($C34,Consolidado!$A:$H,6,0)","v":"Precio por hora"},2,{"$f":"VLOOKUP($C34,Consolidado!$A:$H,7,0)","v":"Hora"},{"$f":"VLOOKUP(C34,temp!$A:$BD,53,0)","v":99844},103572.61410788383,103572.61410788383,207145.22821576765,{"$f":"IF(VLOOKUP(C34,temp!$A:$H,8,0)=\"SI\",Q34*19%,0)","v":39357.593360995852},246502.8215767635,"CO-MI-01 - Servicio de Preparación para la migración-Servicios de migración_NA-NA - 1 Precio por hora"]
[null,"1. Si requiere agregue o elimine filas"]
[null,null,null,null,null,null,null,null,null,null,null,null,null,null,null,null,"Total Servicios","IVA","Total"]
[null,null,null,null,null,null,null,null,null,null,null,null,null,null,null,null,{"$f":"ROUND(SUM($Q$32:$Q$34),2)","v":330776378.26999998},{"$f":"ROUND(SUM($R$32:$R$34),2)","v":6768802.6900000004},{"$f":"ROUND(R37+Q37,2)","v":337545180.95999998}]
[null,"Gravámenes adicionales*"]
[]
[null,"Gravámenes adicionales (estampillas)"]
[null,"No","Descripción",null,null,null,"Porcentaje"]
[null,1,"Estampilla Universidad Distrital Francisco José de Caldas 50 años ",null,null,null,1.0999999999999999E-2,"","","","","",""]
[null,2,"Estampilla Pro Adultos Mayores",null,null,null,0.02]
[null,3,"Estampilla Pro Cultura",null,null,null,5.0000000000000001E-3]
[null,null,null,null,null,"Total porcentaje:",{"$f":"ROUND(SUM(G42:G44),4)","v":3.5999999999999997E-2}]
[null,null,null,"Filas a agregar o eliminar Gravámenes:"]
[null,null,null,1]

{"sheet":"Cotizacion","index":3,"n_rows":47,"n_cols":22,"rows_kept":47,"cut":false,"hidden":false,"merged":[[29,13,29,21],[33,3,33,4],[33,5,33,6],[41,2,41,5],[42,2,42,5],[43,2,43,5],[30,3,30,4],[30,5,30,6],[31,3,31,4],[31,5,31,6],[32,3,32,4],[32,5,32,6],[24,1,24,3],[24,5,24,7],[24,8,24,10],[27,1,27,3],[29,1,29,12],[21,8,21,10],[21,11,22,11],[21,12,22,12],[22,8,22,10],[23,1,23,3],[23,5,23,7],[23,8,23,10],[20,1,20,3],[20,5,20,7],[21,1,22,3],[21,4,22,4],[21,5,22,7],[16,1,16,3],[16,9,16,10],[18,1,18,3],[18,5,18,7],[18,8,18,10],[14,1,14,12],[15,1,15,3],[15,4,15,6],[1,1,1,12],[5,4,5,6],[7,4,7,6],[9,4,9,6],[11,1,11,3],[11,4,11,6],[3,1,3,12],[5,11,5,12],[7,11,7,12],[9,11,9,12]]}
[{"$f":"SolCotizacion!$L$17","v":3858.56}]
[null,"Solicitud de Cotización\nNube Pública 2G"]
[]
[null,"Información de la Entidad Compradora"]
[]
[null,"Nombre de la Entidad",null,null,{"$f":"SolCotizacion!E6","v":"UNIVERSIDAD DISTRITAL FRANCISCO JOSÉ DE CALDAS"},null,null,null,null,"NIT",null,{"$f":"SolCotizacion!L6","v":"899999230-7"}]
[]
[null,"Dirección de la Entidad",null,null,{"$f":"SolCotizacion!E8","v":"Carrera 7 N. 40B 53"},null,null,null,null,"Correo de contacto",null,{"$f":"SolCotizacion!L8","v":"planesticud@udistrital.edu.co"}]
[]
[null,"Municipio",null,null,{"$f":"SolCotizacion!E10","v":"Bogotá D.C."},null,null,null,null,"Teléfono de contacto",null,{"$f":"SolCotizacion!L10","v":" 3239300 Ext. 6338"}]
[]
[null,"Nombre funcionario Comprador",null,null,{"$f":"SolCotizacion!E12","v":"EDUARD ARNULFO PINILLA"}]
[]
[]
[null,"Cotización"]
[null,"Proveedor",null,null,"UT Gestion integral cloud - Segm 1. Amazon"]
[null,"Tasa de intermediación",null,null,"Autogestionado",null,null,null,null,"TRM",null,3858.56]
[]
[null,"Cloud Service Provider",null,null,"Segmento","link Catálogo Productos/Servicios",null,null,"Link Calculadora",null,null,"USD","Valor"]
[]
[null,"Segm 1. Amazon",null,null,"Si","https://aws.amazon.com/es/products/",null,null,"https://calculator.s3.amazonaws.com/index.html",null,null,73738.820000000007,{"$f":"L21*$L$17","v":284525661.2992}]
[null,"Segm 2. Google",null,null,"No","https://cloud.google.com/products/",null,null,"https://cloud.google.com/products/calculator/",null,null,0,{"$f":"L22*$L$17","v":0}]
[null,null,null,null,null,null,null,null,"https://cloud.google.com/maps-platform/pricing/?hl=es"]
[null,"Segm 4. Microsoft",null,null,"No","https://azure.microsoft.com/es-mx/services/",null,null,"https://azure.microsoft.com/en-us/pricing/calculator/",null,null,0,0]
[null,"Segm 5. Oracle",null,null,"No","https://www.oracle.com/co/cloud/",null,null,"https://cloud.oracle.com/en_US/cost-estimator",null,null,0,0]
[null,"Cantidad de filas:"]
[]
[null,1]
[null,null,null,null,null,null,null,null,null,null,null,null,null,{"$f":"VLOOKUP($C$33,temp!$A:$AZ,MATCH(Cotizacion!$E$16,temp!$A$1:$AZ$1,0),0)","v":0.1},null,{"$f":"VLOOKUP(\"CO-GE-03\",Consolidado!$A:$AZ,MATCH(Cotizacion!$E$16,Consolidado!$A$1:$AZ$1,0),0)","v":0.04}]
[null,"Paquete de Servicios",null,null,null,null,null,null,null,null,null,null,null,"Valores"]
[null,"Item","Cod. Matriz","Nombre del Servicio",null,"Tipo de Servicio",null,"Característica 1","Característica 2","Capacidad","Unidad x Capacidad","Cantidad en Tiempo","Unidad x Cantidad","Valor Unitario","Precio maximo autorizado","Descuento adicional","Precio con Descuento","Valor X Capacidad","Precio Total","Incluir IVA","IVA","Total"]
[null,1,"CO-NP-01",{"$f":"VLOOKUP($C32,Consolidado!$A:$H,2,0)","v":"Servicios en la Nube"},null,{"$f":"VLOOKUP($C32,Consolidado!$A:$H,3,0)","v":"NA"},null,{"$f":"VLOOKUP($C32,Consolidado!$A:$H,4,0)","v":"NA"},{"$f":"VLOOKUP($C32,Consolidado!$A:$H,5,0)","v":"NA"},1,{"$f":"VLOOKUP($C32,Consolidado!$A:$H,6,0)","v":"Unidad"},1,{"$f":"VLOOKUP($C32,Consolidado!$A:$H,7,0)","v":"Und"},{"$f":"VLOOKUP($C32,temp!$A:$AZ,MATCH(Cotizacion!$E$16,temp!$A$1:$AZ$1,0),0)","v":284525661.2992},{"$f":"N32/(1-(VLOOKUP(\"Total porcentaje:\",$F:$H,2,0)))","v":295151100.93278009},0.04,{"$f":"O32*(1-P32)","v":283345056.89546889},{"$f":"Q32*J32","v":283345056.89546889},{"$f":"R32*L32","v":283345056.89546889},null,{"$f":"IF(T32=\"SI\",S32*19%,0)","v":0},{"$f":"S32+U32","v":283345056.89546889}]
[null,2,"CO-GE-01",{"$f":"VLOOKUP($C33,Consolidado!$A:$H,2,0)","v":"Tasa de intermediación para servicios autogestionados"},null,{"$f":"VLOOKUP($C33,Consolidado!$A:$H,3,0)","v":"Servicio de Computación en la Nube"},null,{"$f":"VLOOKUP($C33,Consolidado!$A:$H,4,0)","v":"NA"},{"$f":"VLOOKUP($C33,Consolidado!$A:$H,5,0)","v":"NA"},1,{"$f":"VLOOKUP($C33,Consolidado!$A:$H,6,0)","v":"Tasa"},1,{"$f":"VLOOKUP($C33,Consolidado!$A:$H,7,0)","v":"Und"},{"$f":"$N$32*$N$29","v":28452566.129920002},{"$f":"N33/(1-(VLOOKUP(\"Total porcentaje:\",$F:$H,2,0)))","v":29515110.093278013},null,{"$f":"O33*(1-P33)","v":29515110.093278013},{"$f":"Q33*J33","v":29515110.093278013},{"$f":"R33*L33","v":29515110.093278013},"SI",{"$f":"IF(T33=\"SI\",S33*19%,0)","v":5607870.9177228222},{"$f":"S33+U33","v":35122981.011000834}]
[null,3,"CO-MI-01",{"$f":"VLOOKUP($C34,Consolidado!$A:$H,2,0)","v":"Servicio de Preparación para la migración"},null,{"$f":"VLOOKUP($C34,Consolidado!$A:$H,3,0)","v":"Servicios de migración"},null,{"$f":"VLOOKUP($C34,Consolidado!$A:$H,4,0)","v":"NA"},{"$f":"VLOOKUP($C34,Consolidado!$A:$H,5,0)","v":"NA"},1,{"$f":"VLOOKUP($C34,Consolidado!$A:$H,6,0)","v":"Precio por hora"},2,{"$f":"VLOOKUP($C34,Consolidado!$A:$H,7,0)","v":"Hora"},{"$f":"VLOOKUP($C34,temp!$A:$AZ,MATCH(Cotizacion!$E$16,temp!$A$1:$AZ$1,0),0)","v":136000},141078.83817427387,null,141078.83817427387,141078.83817427387,282157.67634854774,"SI",53609.958506224073,335767.63485477184]
[null,"1. Si requiere agregue o elimine filas"]
[null,null,null,null,null,null,null,null,null,null,null,null,null,null,null,null,null,null,"Total Servicios",null,"IVA","Total"]
[null,null,null,null,null,null,null,null,null,null,null,null,null,null,null,null,null,null,{"$f":"ROUND(SUM($S$32:$S$34),2)","v":313142324.67000002},null,{"$f":"ROUND(SUM($U$32:$U$34),2)","v":5661480.8799999999},{"$f":"ROUND(U37+S37,2)","v":318803805.55000001}]
[null,"Gravámenes adicionales*"]
[]
[null,"Gravámenes adicionales (estampillas)"]
[null,"No","Descripción",null,null,null,"Porcentaje"]
[null,1,"Estampilla Universidad Distrital Francisco José de Caldas 50 años ",null,null,null,1.0999999999999999E-2,"","","","","",""]
[null,2,"Estampilla Pro Adultos Mayores",null,null,null,0.02]
[null,3,"Estampilla Pro Cultura",null,null,null,5.0000000000000001E-3]
[null,null,null,null,null,"Total porcentaje:",{"$f":"ROUND(SUM(G42:G44),4)","v":3.5999999999999997E-2}]
[null,null,null,"Filas a agregar o eliminar Gravámenes:"]
[null,null,null,1]

{"sheet":"Consolidado","index":4,"n_rows":183,"n_cols":28,"rows_kept":183,"cut":false,"hidden":true,"merged":[]}
["Código del servicio","Nombre del servicio","Tipo de servicio","Característica 1","Característica 2","Unidad","Unidad TVEC","IVA","Avanxo - Segm 1. Amazon","Soluciones Orion - Segm 2. Google","UT Goldsvada - Segm 1. Amazon","Hightech - Segm 1. Amazon","UT Tecnologia Oracle Eficiente - Segm 5. Oracle","Colombia telecomunicaciones SA - Segm 4. Microsoft","Colsof - Segm 4. Microsoft","Mercanet SAS - Segm 4. Microsoft","Comcel - Segm 4. Microsoft","SETI - Segm 5. Oracle","Eforcers - Segm 2. Google","informacion localizada - Segm 2. Google","S3 SAS - Segm 1. Amazon","UT DPN 2019 - Segm 5. Oracle","UT Gestion integral cloud - Segm 1. Amazon","UT TAKWC - Segm 5. Oracle","UT Nubepublica2019 - Segm 1. Amazon","UT Nubepublica2019 - Segm 4. Microsoft","Clouxter - Segm 1. Amazon","Controles empresariales - Segm 4. Microsoft"]
["CO-GE-01","Tasa de intermediación para servicios autogestionados","Servicio de Computación en la Nube","NA","NA","Tasa","Und","SI",0.12,0.12,0.15,0.06,9.8000000000000004E-2,0.08,0,3.9E-2,5.0000000000000001E-4,0.12,0.01,0,1E-3,0.22,0.1,0.06,0.1,0.1,0.01,0.19]
["CO-GE-02","Tasa de intermediación para servicios gestionados por el Proveedor","Servicio de Computación en la Nube","NA","NA","Tasa","Und","SI",0.19,0.22,0.3,0.6,0.13800000000000001,0.13,0,5.5E-2,0.5,0.1,0.17,0.15,1E-3,0.28000000000000003,0.12,0.06,0.19,0.19,0.2,0.24]
["CO-GE-03","Tasa de descuento ofrecido por el proponente sobre el precio de los servicios de computación en la nube",null,"NA","NA","Tasa","Und","SI",0.02,0.02,0.1,0.05,1.0999999999999999E-2,0.15,0.1,9.5000000000000001E-2,0.08,0.02,0.02,0.02,0,5.0000000000000001E-3,0.04,0.03,7.0000000000000007E-2,7.0000000000000007E-2,0.01,0.04]
["CO-AD-01-01","Sesión formación o capacitación - remoto","Servicios profesionales","NA","NA","Precio por sesión (sesión de 4 horas hasta 10 asistentes)","Sesion","SI",347942.88,496080,836976,2120000,1198224,627338.74,1113000,366336,1958894.84,876581.84000000008,3243600,1904791.3800000001,659564.30783400743,1821461.6,576640,3737621.4621920004,757158,757158,407040,1534091.36]
["CO-AD-01-02","Sesión formación o capacitación - zona 1","Servicios profesionales","NA","NA","Precio por sesión (sesión de 4 horas hasta 10 asistentes)","Sesion","SI",549766.88,545688.00000000012,2175544,3710000,1463224,658828.16,1309418,439603.20000000001,2350674.02,1236735.3587300002,3243600,2242536,936925.24468598701,3531920,720800,4049090.4370220001,1055018,1055018,424000,1687499.86]
["CO-AD-01-03","Sesión formación o capacitación - zona 2","Servicios profesionales","NA","NA","Precio por sesión (sesión de 4 horas hasta 10 asistentes)","Sesion","SI",665094.88,580413.6,2415952,4240000,1516224,690873.02,1590000,517754.88,3134232.3800000004,1236735.3587300002,3243600,3918505.18,1491647.1183899459,3531920,1153280,4983495.579864,1294260,1294260,508800,1840909.4200000002]
["CO-AD-01-04","Sesión formación o capacitación - zona 3","Servicios profesionales","NA","NA","Precio por sesión (sesión de 4 horas hasta 10 asistentes)","Sesion","SI",708342.88,605217.6,2656360,4770000,1728224,721501.72000000009,1590000,558784.51199999999,3917789.68,1236735.3587300002,3243600,4485072,3294493.2079278128,3531920,1441600,6229368.8067120006,1499158,1499158,508800,1994318.9800000002]
["CO-AD-02-01","Experto para la definición, análisis y adopción de Nube Pública - remoto","Servicios profesionales","NA","NA","Precio por hora","Hora","SI",269876,124020,209244,254400,249630,156970.1,265212,57240,178245.04751200002,205274.30000000002,396440,191860,249208.80176150365,455365.4,180200,249174.82349200002,138860,138860,201188,191761.42]
["CO-AD-02-02","Experto para la definición, análisis y adopción de Nube Pública - zona 1","Servicios profesionales","NA","NA","Precio por hora","Hora","SI",330296,136422.00000000003,469686,307400,315880,156970.1,398242,114480,207952.55546599999,250293.56000000003,396440,234260,318549.03597449849,567630,216240,373762.23534400004,238500,238500,201188,210936.82]
["CO-AD-02-03","Experto para la definición, análisis y adopción de Nube Pública - zona 2","Servicios profesionales","NA","NA","Precio por hora","Hora","SI",358492,145103.4,529788,371000,329130,156970.1,442020,134832,265387.07076600002,250293.56000000003,324360,221646,457229.50440048828,567630,288320,622937.05883600004,298390,298390,201188,230113.28]
["CO-AD-02-04","Experto para la definición, análisis y adopción de Nube Pública - zona 3","Servicios profesionales","NA","NA","Precio por hora","Hora","SI",370576,151304.4,589890,381600,382130,156970.1,442020,145516.80000000002,308165.88211800001,250293.56000000003,180200,209032,907941.02678495506,693770,396440,1557342.2016780002,292772,292772,201188,249289.74000000002]
["CO-EX-01-01","Experto Junior en Recuperacion ante Desastres - remoto","Servicios profesionales","NA","NA","Precio por hora","Hora","SI",88616,124020,124656,190800,149778,122144.86,161438,45792,82808.030828000003,371184.44,162180,101760,164891.07695850186,379681.4,180200,280321.89910800004,138860,138860,166303.4,116854.40000000001]
["CO-EX-01-02","Experto Junior en Recuperacion ante Desastres - zona 1","Servicios profesionales","NA","NA","Precio por hora","Hora","SI",153064,136422.00000000003,272685,243800,216028,122144.86,242422,54950.400000000001,112515.538782,445421.54000000004,180200,144160,234231.31117149675,567630,216240,311468.97483000002,181790,181790,166303.4,128539.84000000001]
["CO-EX-01-03","Experto Junior en Recuperacion ante Desastres - zona 2","Servicios profesionales","NA","NA","Precio por hora","Hora","SI",177232,145103.4,302736,307400,229278,122144.86,269028,64719.360000000001,169950.05408200002,541035.66,162180,131546,372911.77959748649,567630,288320,498349.64709000004,247934,247934,166303.4,140225.28]
["CO-EX-01-04","Experto Junior en Recuperacion ante Desastres - zona 3","Servicios profesionales","NA","NA","Precio por hora","Hora","SI",189316,151304.4,237970,318000,282278,122144.86,269028,69848.063999999998,212728.86543400001,619265.78,162180,118932,823623.30198195321,630700,396440,1245874.1176720001,292772,292772,166303.4,151910.72]
["CO-EX-02-01","Experto Senior en Recuperacion ante Desastres - remoto","Servicios profesionales","NA","NA","Precio por hora","Hora","SI",136952,148824,213696,296800,216346,156970.1,265212,80136,127197.203402,521913.26,288320,191860,249208.80176150365,455365.4,234260,373762.23534400004,189316,189316,232988,191761.42]
["CO-EX-02-02","Experto Senior en Recuperacion ante Desastres - zona 1","Servicios profesionales","NA","NA","Precio por hora","Hora","SI",201400,163706.4,415149,349800,282596,156970.1,398242,96163.200000000012,156904.71125000002,521913.26,324360,234260,318549.03597449849,630700,342380,436056.38657600002,256202,256202,232988,210936.82]
["CO-EX-02-03","Experto Senior en Recuperacion ante Desastres - zona 2","Servicios profesionales","NA","NA","Precio por hora","Hora","SI",225568,174124.08000000002,445200,413400,295846,156970.1,442020,113258.88,214339.22655000002,584496.72,252280,221646,457229.50440048828,630700,432480,622937.05883600004,317682,317682,232988,230113.28]
["CO-EX-02-04","Experto Senior en Recuperacion ante Desastres - zona 3","Servicios profesionales","NA","NA","Precio por hora","Hora","SI",237652,181565.28,475251,424000,348846,156970.1,442020,122234.11200000001,257118.038008,730525.5,180200,209032,907941.02678495506,693770,486540,1557342.2016780002,374816,374816,232988,249289.74000000002]
["CO-EX-03-01","Experto Junior en Backup y Archivado - remoto","Servicios profesionales","NA","NA","Precio por hora","Hora","SI",88616,124020,119647.5,190800,149778,122144.86,115328,45792,58348.036126000006,445421.54000000004,162180,101760,164891.07695850186,379681.4,144160,280321.89910800004,138860,138860,127072.8,116854.40000000001]
["CO-EX-03-02","Experto Junior en Backup y Archivado - zona 1","Servicios profesionales","NA","NA","Precio por hora","Hora","SI",153064,136422.00000000003,249868.5,243800,216028,122144.86,173204,54950.400000000001,88055.544080000007,445421.54000000004,180200,144160,234231.31117149675,567630,180200,311468.97483000002,181790,181790,127072.8,128539.84000000001]
["CO-EX-03-03","Experto Junior en Backup y Archivado - zona 2","Servicios profesionales","NA","NA","Precio por hora","Hora","SI",177232,145103.4,279919.5,307400,229278,122144.86,192178,64719.360000000001,145490.05937999999,541035.66,162180,131546,372911.77959748649,567630,216240,498349.64709000004,247934,247934,127072.8,140225.28]
["CO-EX-03-04","Experto Junior en Backup y Archivado - zona 3","Servicios profesionales","NA","NA","Precio por hora","Hora","SI",189316,151304.4,309970.5,318000,282278,122144.86,192178,69848.063999999998,188268.87073200001,619265.78,162180,118932,823623.30198195321,630700,252280,1245874.1176720001,292772,292772,127072.8,151910.72]
["CO-EX-04-01","Experto Senior en Backup y Archivado - remoto","Servicios profesionales","NA","NA","Precio por hora","Hora","SI",136952,148824,191436,296800,249630,156970.1,172992,57240,122473.34870000002,521913.26,288320,191860,249208.80176150365,455365.4,234260,373762.23534400004,189316,189316,210728,191761.42]
["CO-EX-04-02","Experto Senior en Backup y Archivado - zona 1","Servicios profesionales","NA","NA","Precio por hora","Hora","SI",201400,163706.4,321657,349800,315880,156970.1,259700,68688,152180.856654,521913.26,324360,234260,318549.03597449849,630700,252280,436056.38657600002,256202,256202,210728,210936.82]
["CO-EX-04-03","Experto Senior en Backup y Archivado - zona 2","Servicios profesionales","NA","NA","Precio por hora","Hora","SI",225568,174124.08000000002,351708,413400,329130,156970.1,288320,80899.199999999997,209615.371954,584496.72,252280,221646,457229.50440048828,630700,270300,622937.05883600004,317682,317682,210728,230113.28]
["CO-EX-04-04","Experto Senior en Backup y Archivado - zona 3","Servicios profesionales","NA","NA","Precio por hora","Hora","SI",237652,181565.28,381759,424000,382130,156970.1,288320,87310.080000000002,252394.18330600002,730525.5,180200,209032,907941.02678495506,693770,306340,1557342.2016780002,374816,374816,210728,249289.74000000002]
["CO-EX-05-01","Experto Junior en Seguridad en la Nube - remoto","Servicios profesionales","NA","NA","Precio por hora","Hora","SI",229596,124020,163833.60000000001,190800,199704,122144.86,161438,45792,93971.692717999991,445421.54000000004,162180,101760,164891.07695850186,379681.4,165784,280321.89910800004,138860,138860,157728,191761.42]
["CO-EX-05-02","Experto Junior en Seguridad en la Nube - zona 1","Servicios profesionales","NA","NA","Precio por hora","Hora","SI",294044,136422.00000000003,308301,243800,265954,122144.86,242422,54950.400000000001,123679.20067200001,445421.54000000004,180200,144160,234231.31117149675,567630,187408,311468.97483000002,181790,181790,157728,210936.82]
["CO-EX-05-03","Experto Junior en Seguridad en la Nube - zona 2","Servicios profesionales","NA","NA","Precio por hora","Hora","SI",318212,145103.4,338352,307400,279204,122144.86,269028,64719.360000000001,181113.71597200001,541035.66,162180,131546,372911.77959748649,567630,216240,498349.64709000004,247934,247934,157728,230113.28]
["CO-EX-05-04","Experto Junior en Seguridad en la Nube - zona 3","Servicios profesionales","NA","NA","Precio por hora","Hora","SI",330296,151304.4,368403,318000,332204,122144.86,269028,69848.063999999998,223892.52732400002,619265.78,162180,118932,823623.30198195321,630700,270300,1245874.1176720001,292772,292772,157728,249289.74000000002]
["CO-EX-06-01","Experto Senior en Seguridad en la Nube - remoto","Servicios profesionales","NA","NA","Precio por hora","Hora","SI",269876,148824,258216,296800,490939,156970.1,294044,57240,138660.82154800001,521913.26,396440,191860,249208.80176150365,455365.4,252280,373762.23534400004,189316,189316,210728,221724.44]
["CO-EX-06-02","Experto Senior en Seguridad en la Nube - zona 1","Servicios profesionales","NA","NA","Precio por hora","Hora","SI",334324,163706.4,450765,349800,557189,156970.1,441490,68688,168368.32950200001,521913.26,396440,234260,318549.03597449849,630700,273904,436056.38657600002,256202,256202,210728,243896.46000000002]
["CO-EX-06-03","Experto Senior en Seguridad en la Nube - zona 2","Servicios profesionales","NA","NA","Precio por hora","Hora","SI",358492,174124.08000000002,480816,413400,570439,156970.1,490038,80899.199999999997,255510.35275600001,584496.72,324360,221646,457229.50440048828,630700,306340,622937.05883600004,317682,317682,210728,266068.48000000004]
["CO-EX-06-04","Experto Senior en Seguridad en la Nube - zona 3","Servicios profesionales","NA","NA","Precio por hora","Hora","SI",370576,181565.28,510867,424000,623439,156970.1,490038,87310.080000000002,385431.18736200006,730525.5,180200,209032,907941.02678495506,693770,360400,1557342.2016780002,374816,374816,210728,288241.56]
["CO-EX-07-01","Experto Junior en Migración - remoto","Servicios profesionales","NA","NA","Precio por hora","Hora","SI",105877.04000000001,124020,130777.5,190800,149778,122144.86,161438,45792,47897.487858,186331.04,162180,101760,164891.07695850186,379681.4,180200,280321.89910800004,138860,138860,104728,116854.40000000001]
["CO-EX-07-02","Experto Junior en Migración - zona 1","Servicios profesionales","NA","NA","Precio por hora","Hora","SI",156333.04,136422.00000000003,260998.5,243800,216028,122144.86,242422,54950.400000000001,77604.995706000002,276369.56,180200,144160,234231.31117149675,567630,216240,311468.97483000002,181790,181790,104728,128539.84000000001]
["CO-EX-07-03","Experto Junior en Migración - zona 2","Servicios profesionales","NA","NA","Precio por hora","Hora","SI",185165.04,145103.4,291049.5,307400,229278,122144.86,269028,64719.360000000001,164747.01895999999,276369.56,162180,131546,372911.77959748649,567630,252280,498349.64709000004,247934,247934,104728,140225.28]
["CO-EX-07-04","Experto Junior en Migración - zona 3","Servicios profesionales","NA","NA","Precio por hora","Hora","SI",195977.04,151304.4,321100.5,318000,282278,122144.86,269028,69848.063999999998,294667.85356600001,276369.56,162180,118932,823623.30198195321,630700,288320,1245874.1176720001,292772,292772,104728,151910.72]
["CO-EX-08-01","Experto Senior en Migración - remoto","Servicios profesionales","NA","NA","Precio por hora","Hora","SI",137073.9,148824,183088.5,296800,216346,156970.1,294044,57240,99939.168357999995,348909.60000000003,396440,191860,249208.80176150365,455365.4,234260,373762.23534400004,189316,189316,263728,191761.42]
["CO-EX-08-02","Experto Senior en Migración - zona 1","Servicios profesionales","NA","NA","Precio por hora","Hora","SI",187529.90000000002,163706.4,313309.5,349800,282596,156970.1,441490,68688,129646.676206,438948.12,396440,234260,318549.03597449849,630700,270300,436056.38657600002,256202,256202,263728,210936.82]
["CO-EX-08-03","Experto Senior en Migración - zona 2","Servicios profesionales","NA","NA","Precio por hora","Hora","SI",216361.90000000002,174124.08000000002,343360.5,413400,295846,156970.1,490038,80899.199999999997,216788.69946,438948.12,324360,221646,457229.50440048828,630700,306340,622937.05883600004,317682,317682,263728,230113.28]
["CO-EX-08-04","Experto Senior en Migración - zona 3","Servicios profesionales","NA","NA","Precio por hora","Hora","SI",227173.90000000002,181565.28,373411.5,424000,348846,156970.1,490038,87310.080000000002,346709.53406600002,438948.12,180200,209032,907941.02678495506,693770,342380,1557342.2016780002,374816,374816,263728,249289.74000000002]
["CO-EX-09-01","Arquitecto Junior en Nube Hibrida - remoto","Servicios profesionales","NA","NA","Precio por hora","Hora","SI",161120,124020,130777.5,254400,199704,156970.1,184546,45792,138933.12293400001,445421.54000000004,162180,101760,164891.07695850186,379681.4,180200,280321.89910800004,138860,138860,232988,191761.42]
["CO-EX-09-02","Arquitecto Junior en Nube Hibrida - zona 1","Servicios profesionales","NA","NA","Precio por hora","Hora","SI",221540,136422.00000000003,260998.5,307400,265954,156970.1,277084,54950.400000000001,168640.63088799999,445421.54000000004,180200,144160,234231.31117149675,567630,216240,311468.97483000002,181790,181790,232988,210936.82]
["CO-EX-09-03","Arquitecto Junior en Nube Hibrida - zona 2","Servicios profesionales","NA","NA","Precio por hora","Hora","SI",249736,145103.4,291049.5,371000,279204,156970.1,307506,64719.360000000001,255782.65414200001,541035.66,162180,131546,372911.77959748649,567630,252280,498349.64709000004,247934,247934,232988,230113.28]
["CO-EX-09-04","Arquitecto Junior en Nube Hibrida - zona 3","Servicios profesionales","NA","NA","Precio por hora","Hora","SI",261820,151304.4,321100.5,381600,332204,156970.1,307506,69848.063999999998,385703.488748,619265.78,162180,118932,823623.30198195321,630700,288320,1245874.1176720001,292772,292772,232988,249289.74000000002]
["CO-EX-10-01","Arquitecto Senior en Nube Hibrida - remoto","Servicios profesionales","NA","NA","Precio por hora","Hora","SI",269876,148824,209244,402800,249630,156970.1,294044,80136,178245.04751200002,521913.26,396440,191860,249208.80176150365,455365.4,234260,373762.23534400004,189316,189316,338988,221724.44]
["CO-EX-10-02","Arquitecto Senior en Nube Hibrida - zona 1","Servicios profesionales","NA","NA","Precio por hora","Hora","SI",330296,163706.4,339465,455800,315880,156970.1,441490,96163.200000000012,207952.55546599999,521913.26,396440,234260,318549.03597449849,630700,252280,436056.38657600002,256202,256202,338988,243896.46000000002]
["CO-EX-10-03","Arquitecto Senior en Nube Hibrida - zona 2","Servicios profesionales","NA","NA","Precio por hora","Hora","SI",358492,174124.08000000002,369516,519400,329130,156970.1,490038,113258.88,295094.57861400006,584496.72,324360,221646,457229.50440048828,630700,306340,622937.05883600004,317682,317682,338988,266068.48000000004]
["CO-EX-10-04","Arquitecto Senior en Nube Hibrida - zona 3","Servicios profesionales","NA","NA","Precio por hora","Hora","SI",370576,181565.28,399567,530000,382130,156970.1,490038,122234.11200000001,425015.41321999999,730525.5,252280,209032,907941.02678495506,693770,414460,1557342.2016780002,374816,374816,338988,288241.56]
["CO-EX-11-01","Experto Junior en Bases de Datos - remoto","Servicios profesionales","NA","NA","Precio por hora","Hora","SI",132924,124020,143100,190800,149778,122144.86,184546,45792,57037.840086000004,79268.92,162180,101760,164891.07695850186,379681.4,165784,280321.89910800004,138860,138860,136528,116854.40000000001]
["CO-EX-11-02","Experto Junior en Bases de Datos - zona 1","Servicios profesionales","NA","NA","Precio por hora","Hora","SI",197372,136422.00000000003,228960,243800,216028,122144.86,277084,54950.400000000001,86745.348039999997,124288.18000000001,180200,144160,234231.31117149675,567630,187408,311468.97483000002,181790,181790,136528,128539.84000000001]
["CO-EX-11-03","Experto Junior en Bases de Datos - zona 2","Servicios profesionales","NA","NA","Precio por hora","Hora","SI",221540,145103.4,256435.20000000001,307400,229278,122144.86,307506,64719.360000000001,173887.37129400001,124288.18000000001,162180,131546,372911.77959748649,567630,216240,498349.64709000004,247934,247934,136528,140225.28]
["CO-EX-11-04","Experto Junior en Bases de Datos - zona 3","Servicios profesionales","NA","NA","Precio por hora","Hora","SI",233624,151304.4,282078.72000000003,318000,282278,122144.86,307506,69848.063999999998,303808.20590000006,124288.18000000001,162180,118932,823623.30198195321,630700,270300,1245874.1176720001,292772,292772,136528,151910.72]
["CO-EX-12-01","Experto Senior en Bases de Datos - remoto","Servicios profesionales","NA","NA","Precio por hora","Hora","SI",185288,148824,200340,296800,216346,156970.1,368986,80136,189797.84992400001,125383.16,288320,191860,249208.80176150365,455365.4,252280,373762.23534400004,189316,189316,222388,191761.42]
["CO-EX-12-02","Experto Senior en Bases de Datos - zona 1","Servicios profesionales","NA","NA","Precio por hora","Hora","SI",249736,163706.4,280476,349800,282596,156970.1,554062,96163.200000000012,219505.35777200002,170402.42,324360,234260,318549.03597449849,630700,273904,436056.38657600002,256202,256202,222388,210936.82]
["CO-EX-12-03","Experto Senior en Bases de Datos - zona 2","Servicios profesionales","NA","NA","Precio por hora","Hora","SI",273904,174124.08000000002,364618.80000000005,413400,295846,156970.1,614906,113258.88,306647.38102600002,170402.42,252280,221646,457229.50440048828,630700,306340,622937.05883600004,317682,317682,222388,230113.28]
["CO-EX-12-04","Experto Senior en Bases de Datos - zona 3","Servicios profesionales","NA","NA","Precio por hora","Hora","SI",285988,181565.28,419311.62,424000,348846,156970.1,614906,122234.11200000001,436568.21563200001,170402.42,180200,209032,907941.02678495506,693770,360400,1557342.2016780002,374816,374816,222388,249289.74000000002]
["CO-EX-13-01","Experto Junior en Servidores y Aplicaciones Web - remoto","Servicios profesionales","NA","NA","Precio por hora","Hora","SI",88616,124020,130777.5,190800,149778,122144.86,184546,40068,56693.972906000003,93840.74,162180,101760,164891.07695850186,379681.4,165784,280321.89910800004,138860,138860,137588,116854.40000000001]
["CO-EX-13-02","Experto Junior en Servidores y Aplicaciones Web - zona 1","Servicios profesionales","NA","NA","Precio por hora","Hora","SI",153064,136422.00000000003,260998.5,243800,216028,122144.86,277084,48081.600000000006,86401.480860000011,138860,180200,144160,234231.31117149675,567630,187408,311468.97483000002,181790,181790,137588,128539.84000000001]
["CO-EX-13-03","Experto Junior en Servidores y Aplicaciones Web - zona 2","Servicios profesionales","NA","NA","Precio por hora","Hora","SI",177232,145103.4,291049.5,307400,229278,122144.86,307506,56629.440000000002,143835.99616000001,138860,162180,131546,372911.77959748649,567630,216240,498349.64709000004,247934,247934,137588,140225.28]
["CO-EX-13-04","Experto Junior en Servidores y Aplicaciones Web - zona 3","Servicios profesionales","NA","NA","Precio por hora","Hora","SI",189316,151304.4,321100.5,318000,282278,122144.86,307506,61117.056000000004,186614.80761800002,138860,162180,118932,823623.30198195321,630700,270300,1245874.1176720001,292772,292772,137588,151910.72]
["CO-EX-14-01","Experto Senior en Servidores y Aplicaciones Web - remoto","Servicios profesionales","NA","NA","Precio por hora","Hora","SI",136952,148824,209244,296800,216346,156970.1,265212,57240,168762.51043000002,116080.6,288320,191860,249208.80176150365,455365.4,252280,373762.23534400004,189316,189316,201188,191761.42]
["CO-EX-14-02","Experto Senior en Servidores y Aplicaciones Web - zona 1","Servicios profesionales","NA","NA","Precio por hora","Hora","SI",201400,163706.4,339465,349800,282596,156970.1,398242,68688,198470.018384,161099.86000000002,324360,234260,318549.03597449849,630700,273904,436056.38657600002,256202,256202,201188,210936.82]
["CO-EX-14-03","Experto Senior en Servidores y Aplicaciones Web - zona 2","Servicios profesionales","NA","NA","Precio por hora","Hora","SI",225568,174124.08000000002,369516,413400,295846,156970.1,442020,80899.199999999997,255904.53368400002,161099.86000000002,252280,221646,457229.50440048828,630700,306340,622937.05883600004,317682,317682,201188,230113.28]
["CO-EX-14-04","Experto Senior en Servidores y Aplicaciones Web - zona 3","Servicios profesionales","NA","NA","Precio por hora","Hora","SI",237652,181565.28,399577.60000000003,424000,348846,156970.1,442020,87310.080000000002,298683.34503600001,161099.86000000002,180200,209032,907941.02678495506,693770,360400,1557342.2016780002,374816,374816,201188,249289.74000000002]
["CO-EX-15-01","Arquitecto Junior en Nube Publica - remoto","Servicios profesionales","NA","NA","Precio por hora","Hora","SI",161120,124020,130777.5,254400,199704,156970.1,184546,45792,138933.12293400001,93840.74,162180,101760,164891.07695850186,379681.4,180200,280321.89910800004,138860,138860,137588,191761.42]
["CO-EX-15-02","Arquitecto Junior en Nube Publica - zona 1","Servicios profesionales","NA","NA","Precio por hora","Hora","SI",221540,136422.00000000003,260998.5,307400,265954,156970.1,277084,54950.400000000001,168640.63088799999,138860,180200,144160,234231.31117149675,567630,216240,311468.97483000002,181790,181790,137588,210936.82]
["CO-EX-15-03","Arquitecto Junior en Nube Publica - zona 2","Servicios profesionales","NA","NA","Precio por hora","Hora","SI",249736,145103.4,291049.5,371000,279204,156970.1,307506,64719.360000000001,226075.14618800001,138860,162180,131546,372911.77959748649,567630,252280,498349.64709000004,247934,247934,137588,230113.28]
["CO-EX-15-04","Arquitecto Junior en Nube Publica - zona 3","Servicios profesionales","NA","NA","Precio por hora","Hora","SI",261820,151304.4,321100.5,381600,332204,156970.1,307506,69848.063999999998,268853.95764600002,138860,162180,118932,823623.30198195321,630700,288320,1245874.1176720001,292772,292772,137588,249289.74000000002]
["CO-EX-16-01","Arquitecto Senior en Nube Publica - remoto","Servicios profesionales","NA","NA","Precio por hora","Hora","SI",269876,148824,209244,360400,249630,156970.1,265212,80136,178245.04751200002,205274.30000000002,396440,191860,249208.80176150365,455365.4,252280,373762.23534400004,189316,189316,316728,221724.44]
["CO-EX-16-02","Arquitecto Senior en Nube Publica - zona 1","Servicios profesionales","NA","NA","Precio por hora","Hora","SI",330296,163706.4,339465,413400,315880,156970.1,398242,96163.200000000012,207952.55546599999,250293.56000000003,396440,234260,318549.03597449849,630700,288320,436056.38657600002,256202,256202,316728,243896.46000000002]
["CO-EX-16-03","Arquitecto Senior en Nube Publica - zona 2","Servicios profesionales","NA","NA","Precio por hora","Hora","SI",358492,174124.08000000002,369516,477000,329130,156970.1,442020,113258.88,295094.57861400006,250293.56000000003,324360,221646,457229.50440048828,630700,324360,622937.05883600004,317682,317682,316728,266068.48000000004]
["CO-EX-16-04","Arquitecto Senior en Nube Publica - zona 3","Servicios profesionales","NA","NA","Precio por hora","Hora","SI",370576,181565.28,399577.60000000003,487600,382130,156970.1,442020,122234.11200000001,425015.41321999999,250293.56000000003,252280,209032,907941.02678495506,693770,360400,1557342.2016780002,374816,374816,316728,288241.56]
["CO-EX-17-01","Experto Junior en Manejo de Datos - remoto","Servicios profesionales","NA","NA","Precio por hora","Hora","SI",306128,117819,143100,190800,149778,122144.86,184546,40068,237660.06331400003,92490.3,162180,191860,164891.07695850186,379681.4,165784,280321.89910800004,138860,138860,148188,191761.42]
["CO-EX-17-02","Experto Junior en Manejo de Datos - zona 1","Servicios profesionales","NA","NA","Precio por hora","Hora","SI",370576,129600.90000000002,228960,243800,216028,122144.86,277084,48081.600000000006,267367.571268,137509.56,180200,234260,234231.31117149675,567630,187408,311468.97483000002,181790,181790,148188,210936.82]
["CO-EX-17-03","Experto Junior en Manejo de Datos - zona 2","Servicios profesionales","NA","NA","Precio por hora","Hora","SI",394744,137848.22999999998,256435.20000000001,307400,229278,122144.86,307506,56629.440000000002,324802.08656800003,137509.56,162180,221646,372911.77959748649,567630,216240,498349.64709000004,247934,247934,148188,230113.28]
["CO-EX-17-04","Experto Junior en Manejo de Datos - zona 3","Servicios profesionales","NA","NA","Precio por hora","Hora","SI",406828,143739.18,282078.72000000003,318000,282278,122144.86,307506,61117.056000000004,367580.89791999996,137509.56,162180,209032,823623.30198195321,630700,270300,1245874.1176720001,292772,292772,148188,249289.74000000002]
["CO-EX-18-01","Experto Senior en Manejo de Datos - remoto","Servicios profesionales","NA","NA","Precio por hora","Hora","SI",330296,142623,200340,296800,249630,156970.1,294044,68688,316880.08445400005,143635.30000000002,252280,281960,249208.80176150365,455365.4,252280,373762.23534400004,189316,189316,210728,221724.44]
["CO-EX-18-02","Experto Senior en Manejo de Datos - zona 1","Servicios profesionales","NA","NA","Precio por hora","Hora","SI",390716,156885.30000000002,280476,349800,315880,156970.1,441490,82425.600000000006,346587.59240800003,188654.56,324360,324360,318549.03597449849,630700,273904,436056.38657600002,256202,256202,210728,243896.46000000002]
["CO-EX-18-03","Experto Senior en Manejo de Datos - zona 2","Servicios profesionales","NA","NA","Precio por hora","Hora","SI",418912,166868.91,364618.80000000005,413400,329130,156970.1,490038,97079.040000000008,404022.10770800005,188654.56,216240,311746,457229.50440048828,630700,306340,622937.05883600004,317682,317682,210728,266068.48000000004]
["CO-EX-18-04","Experto Senior en Manejo de Datos - zona 3","Servicios profesionales","NA","NA","Precio por hora","Hora","SI",430996,174000.06,419311.62,424000,382130,156970.1,490038,104772.09600000001,446800.91905999999,188654.56,180200,299132,907941.02678495506,693770,360400,1557342.2016780002,374816,374816,210728,288241.56]
["CO-EX-19-01","Experto Junior en Inteligencia de Negocios - remoto","Servicios profesionales","NA","NA","Precio por hora","Hora","SI",229596,117819,143100,233200,199704,122144.86,184546,45792,422506.77927200001,92490.3,162180,101760,164891.07695850186,379681.4,165784,280321.89910800004,138860,138860,137588,116854.40000000001]
["CO-EX-19-02","Experto Junior en Inteligencia de Negocios - zona 1","Servicios profesionales","NA","NA","Precio por hora","Hora","SI",290016,129600.90000000002,228960,286200,265954,122144.86,277084,54950.400000000001,452214.28722599999,137509.56,180200,144160,234231.31117149675,567630,187408,311468.97483000002,181790,181790,137588,128539.84000000001]
["CO-EX-19-03","Experto Junior en Inteligencia de Negocios - zona 2","Servicios profesionales","NA","NA","Precio por hora","Hora","SI",318212,137848.22999999998,256435.20000000001,349800,279204,122144.86,307506,64719.360000000001,539356.31037399999,137509.56,162180,131546,372911.77959748649,567630,216240,498349.64709000004,247934,247934,137588,140225.28]
["CO-EX-19-04","Experto Junior en Inteligencia de Negocios - zona 3","Servicios profesionales","NA","NA","Precio por hora","Hora","SI",330296,143739.18,282078.72000000003,360400,332204,122144.86,307506,69848.063999999998,669277.1449800001,137509.56,162180,118932,823623.30198195321,630700,270300,1245874.1176720001,292772,292772,137588,151910.72]
["CO-EX-20-01","Experto Senior en Inteligencia de Negocios - remoto","Servicios profesionales","NA","NA","Precio por hora","Hora","SI",229596,142623,200340,339200,249630,156970.1,265212,80136,237660.06331400003,143635.30000000002,324360,191860,249208.80176150365,455365.4,252280,373762.23534400004,189316,189316,232988,191761.42]
["CO-EX-20-02","Experto Senior en Inteligencia de Negocios - zona 1","Servicios profesionales","NA","NA","Precio por hora","Hora","SI",290016,156885.30000000002,280476,392200,315880,156970.1,398242,96163.200000000012,267367.571268,188654.56,324360,234260,318549.03597449849,630700,273904,436056.38657600002,256202,256202,332416,210936.82]
["CO-EX-20-03","Experto Senior en Inteligencia de Negocios - zona 2","Servicios profesionales","NA","NA","Precio por hora","Hora","SI",318212,166868.91,364618.80000000005,455800,329130,156970.1,442020,113258.88,324802.08656800003,188654.56,216240,221646,457229.50440048828,630700,306340,622937.05883600004,317682,317682,332416,230113.28]
["CO-EX-20-04","Experto Senior en Inteligencia de Negocios - zona 3","Servicios profesionales","NA","NA","Precio por hora","Hora","SI",330296,174000.06,419311.62,466400,382130,156970.1,442020,122234.11200000001,367580.89791999996,188654.56,180200,209032,907941.02678495506,693770,360400,1557342.2016780002,374816,374816,332416,249289.74000000002]
["CO-EX-21-01","Experto Junior en Big Data - remoto","Servicios profesionales","NA","NA","Precio por hora","Hora","SI",306128,117819,143100,254400,299556,299161.68,184546,45792,198050.05274400002,92490.3,162180,191860,164891.07695850186,379681.4,165784,311468.97483000002,138860,138860,137588,191761.42]
["CO-EX-21-02","Experto Junior en Big Data - zona 1","Servicios profesionales","NA","NA","Precio por hora","Hora","SI",370576,129600.90000000002,228960,307400,365806,314090.72000000003,277084,54950.400000000001,227757.56069800002,137509.56,180200,234260,234231.31117149675,567630,187408,373762.23534400004,181790,181790,137588,210936.82]
["CO-EX-21-03","Experto Junior en Big Data - zona 2","Servicios profesionales","NA","NA","Precio por hora","Hora","SI",394744,137848.22999999998,256435.20000000001,371000,379056,329362.14,307506,64719.360000000001,285192.07599799999,137509.56,162180,221646,372911.77959748649,567630,216240,560643.79832200008,247934,247934,137588,230113.28]
["CO-EX-21-04","Experto Junior en Big Data - zona 3","Servicios profesionales","NA","NA","Precio por hora","Hora","SI",406828,143739.18,282078.72000000003,381600,432056,343966.82,307506,69848.063999999998,327970.88745600003,137509.56,162180,209032,823623.30198195321,630700,270300,1370461.529418,292772,292772,137588,249289.74000000002]
["CO-EX-22-01","Experto Senior en Big Data - remoto","Servicios profesionales","NA","NA","Precio por hora","Hora","SI",330296,142623,200340,360400,490939,345108.44,294044,80136,277270.07388400001,167257.4,396440,281960,249208.80176150365,455365.4,252280,498349.64709000004,189316,189316,332416,221724.44]
["CO-EX-22-02","Experto Senior en Big Data - zona 1","Servicios profesionales","NA","NA","Precio por hora","Hora","SI",390716,156885.30000000002,280476,413400,557189,362084.34,441490,96163.200000000012,306977.58183799998,212276.66,396440,324360,318549.03597449849,630700,273904,622937.05883600004,256202,256202,332416,243896.46000000002]
["CO-EX-22-03","Experto Senior en Big Data - zona 2","Servicios profesionales","NA","NA","Precio por hora","Hora","SI",418912,166868.91,364618.80000000005,477000,570439,379527.7,490038,113258.88,364412.09713800001,212276.66,324360,311746,457229.50440048828,630700,306340,934406.033666,317682,317682,332416,266068.48000000004]
["CO-EX-22-04","Experto Senior en Big Data - zona 3","Servicios profesionales","NA","NA","Precio por hora","Hora","SI",430996,174000.06,419311.62,487600,623439,397054.80000000005,490038,122234.11200000001,407190.90849,212276.66,180200,299132,907941.02678495506,693770,360400,1868811.1765079999,374816,374816,232988,288241.56]
["CO-EX-23-01","Experto Junior en Almacen de Datos - remoto","Servicios profesionales","NA","NA","Precio por hora","Hora","SI",229596,117819,119647.5,190800,149778,299161.68,184546,45792,178245.04751200002,92490.3,162180,101760,164891.07695850186,379681.4,165784,280321.89910800004,138860,138860,137588,116854.40000000001]
["CO-EX-23-02","Experto Junior en Almacen de Datos - zona 1","Servicios profesionales","NA","NA","Precio por hora","Hora","SI",290016,129600.90000000002,249868.5,243800,216028,314090.72000000003,277084,54950.400000000001,207952.55546599999,137509.56,180200,144160,234231.31117149675,567630,187408,311468.97483000002,181790,181790,137588,128539.84000000001]
["CO-EX-23-03","Experto Junior en Almacen de Datos - zona 2","Servicios profesionales","NA","NA","Precio por hora","Hora","SI",318212,137848.22999999998,279919.5,307400,229278,329362.14,307506,64719.360000000001,265387.07076600002,137509.56,162180,131546,372911.77959748649,567630,216240,498349.64709000004,247934,247934,137588,140225.28]
["CO-EX-23-04","Experto Junior en Almacen de Datos - zona 3","Servicios profesionales","NA","NA","Precio por hora","Hora","SI",330296,143739.18,309970.5,318000,282278,343966.82,307506,69848.063999999998,308165.88211800001,137509.56,162180,118932,823623.30198195321,630700,270300,1245874.1176720001,292772,292772,137588,151910.72]
["CO-EX-24-01","Experto Senior en Almacen de Datos - remoto","Servicios profesionales","NA","NA","Precio por hora","Hora","SI",229596,142623,191436,296800,216346,345108.44,294044,80136,217855.058082,143635.30000000002,396440,281960,249208.80176150365,455365.4,252280,373762.23534400004,189316,189316,232988,191761.42]
["CO-EX-24-02","Experto Senior en Almacen de Datos - zona 1","Servicios profesionales","NA","NA","Precio por hora","Hora","SI",290016,156885.30000000002,321657,349800,282596,362084.34,441490,96163.200000000012,247562.56593000001,188654.56,396440,324360,318549.03597449849,630700,273904,436056.38657600002,256202,256202,232988,210936.82]
["CO-EX-24-03","Experto Senior en Almacen de Datos - zona 2","Servicios profesionales","NA","NA","Precio por hora","Hora","SI",318212,166868.91,351708,413400,295846,379527.7,490038,113258.88,304997.08123000001,188654.56,324360,311746,457229.50440048828,630700,306340,622937.05883600004,317682,317682,232988,230113.28]
["CO-EX-24-04","Experto Senior en Almacen de Datos - zona 3","Servicios profesionales","NA","NA","Precio por hora","Hora","SI",330296,174000.06,381759,424000,348846,397054.80000000005,490038,122234.11200000001,347775.89268800005,188654.56,180200,299132,907941.02678495506,693770,360400,1557342.2016780002,374816,374816,232988,249289.74000000002]
["CO-EX-25-01","Experto Junior en Aplicaciones Empresariales - remoto","Servicios profesionales","NA","NA","Precio por hora","Hora","SI",237652,124020,119647.5,254400,149778,299161.68,184546,45792,138635.03694200001,445421.54000000004,162180,191860,164891.07695850186,379681.4,165784,311468.97483000002,138860,138860,179988,116854.40000000001]
["CO-EX-25-02","Experto Junior en Aplicaciones Empresariales - zona 1","Servicios profesionales","NA","NA","Precio por hora","Hora","SI",302100,136422.00000000003,249868.5,307400,216028,314090.72000000003,277084,54950.400000000001,168342.54489600001,445421.54000000004,180200,234260,234231.31117149675,567630,187408,373762.23534400004,181790,181790,179988,128539.84000000001]
["CO-EX-25-03","Experto Junior en Aplicaciones Empresariales - zona 2","Servicios profesionales","NA","NA","Precio por hora","Hora","SI",326268,145103.4,279919.5,371000,229278,329362.14,307506,64719.360000000001,225777.06019600001,541035.66,162180,221646,372911.77959748649,567630,216240,560643.79832200008,247934,247934,179988,140225.28]
["CO-EX-25-04","Experto Junior en Aplicaciones Empresariales - zona 3","Servicios profesionales","NA","NA","Precio por hora","Hora","SI",338352,151304.4,309970.5,381600,282278,343966.82,307506,69848.063999999998,268555.87154800002,619265.78,162180,209032,823623.30198195321,630700,270300,1370461.529418,292772,292772,179988,151910.72]
["CO-EX-26-01","Experto Senior en Aplicaciones Empresariales - remoto","Servicios profesionales","NA","NA","Precio por hora","Hora","SI",298072,148824,191436,360400,216346,345108.44,294044,80136,198050.05274400002,521913.26,288320,281960,249208.80176150365,455365.4,252280,498349.64709000004,189316,189316,232988,191761.42]
["CO-EX-26-02","Experto Senior en Aplicaciones Empresariales - zona 1","Servicios profesionales","NA","NA","Precio por hora","Hora","SI",362520,163706.4,321657,413400,282596,362084.34,441490,96163.200000000012,227757.56069800002,521913.26,324360,324360,318549.03597449849,630700,273904,622937.05883600004,256202,256202,232988,210936.82]
["CO-EX-26-03","Experto Senior en Aplicaciones Empresariales - zona 2","Servicios profesionales","NA","NA","Precio por hora","Hora","SI",386688,174124.08000000002,351708,477000,295846,379527.7,490038,113258.88,285192.07599799999,584496.72,252280,311746,457229.50440048828,630700,306340,934406.033666,317682,317682,232988,230113.28]
["CO-EX-26-04","Experto Senior en Aplicaciones Empresariales - zona 3","Servicios profesionales","NA","NA","Precio por hora","Hora","SI",398772,181565.28,381759,487600,348846,397054.80000000005,490038,122234.11200000001,327970.88745600003,730525.5,180200,299132,907941.02678495506,693770,360400,1868811.1765079999,374816,374816,232988,249289.74000000002]
["CO-EX-27-01","Experto Junior en Redes - remoto","Servicios profesionales","NA","NA","Precio por hora","Hora","SI",88616,124020,130777.5,190800,149778,122144.86,161438,28620,62202.386926000006,445421.54000000004,162180,101760,164891.07695850186,379681.4,165784,280321.89910800004,138860,138860,137588,116854.40000000001]
["CO-EX-27-02","Experto Junior en Redes - zona 1","Servicios profesionales","NA","NA","Precio por hora","Hora","SI",153064,136422.00000000003,260998.5,243800,216028,128272.72,242422,34344,91909.894880000007,445421.54000000004,180200,144160,234231.31117149675,567630,187408,311468.97483000002,181790,181790,137588,128539.84000000001]
["CO-EX-27-03","Experto Junior en Redes - zona 2","Servicios profesionales","NA","NA","Precio por hora","Hora","SI",177232,145103.4,291049.5,307400,229278,134285.04,269028,40449.599999999999,149344.41018000001,541035.66,162180,131546,372911.77959748649,567630,216240,498349.64709000004,247934,247934,137588,140225.28]
["CO-EX-27-04","Experto Junior en Redes - zona 3","Servicios profesionales","NA","NA","Precio por hora","Hora","SI",189316,151304.4,321100.5,318000,282278,140325.98000000001,269028,43655.040000000001,192123.221532,619265.78,162180,118932,823623.30198195321,630700,270300,1245874.1176720001,292772,292772,137588,151910.72]
["CO-EX-28-01","Experto Senior en Redes - remoto","Servicios profesionales","NA","NA","Precio por hora","Hora","SI",153064,148824,209244,296800,216346,156970.1,265212,40068,112668.474522,521913.26,288320,191860,249208.80176150365,455365.4,252280,373762.23534400004,189316,189316,210728,191761.42]
["CO-EX-28-02","Experto Senior en Redes - zona 1","Servicios profesionales","NA","NA","Precio por hora","Hora","SI",217512,163706.4,339465,349800,282596,164745.20000000001,398242,48081.600000000006,142375.98237000001,521913.26,324360,234260,318549.03597449849,630700,273904,436056.38657600002,256202,256202,210728,210936.82]
["CO-EX-28-03","Experto Senior en Redes - zona 2","Servicios profesionales","NA","NA","Precio por hora","Hora","SI",241680,174124.08000000002,369516,413400,295846,172421.72,442020,56629.440000000002,199810.49767000001,584496.72,252280,221646,457229.50440048828,630700,306340,622937.05883600004,317682,317682,210728,230113.28]
["CO-EX-28-04","Experto Senior en Redes - zona 3","Servicios profesionales","NA","NA","Precio por hora","Hora","SI",253764,181565.28,399567,424000,348846,180451.22,442020,61117.056000000004,242589.30912800002,730525.5,180200,209032,907941.02678495506,693770,360400,1557342.2016780002,374816,374816,210728,249289.74000000002]
["CO-EX-29-01","Experto Junior en Inteligencia Artificial - remoto","Servicios profesionales","NA","NA","Precio por hora","Hora","SI",241680,117819,143100,275600,251856,345108.44,207548,45792,198050.05274400002,103064.86,162180,191860,164891.07695850186,379681.4,180200,311468.97483000002,138860,138860,137588,191761.42]
["CO-EX-29-02","Experto Junior en Inteligencia Artificial - zona 1","Servicios profesionales","NA","NA","Precio por hora","Hora","SI",306128,129600.90000000002,228960,328600,365806,362084.34,311640,54950.400000000001,227757.56069800002,148084.12,180200,234260,234231.31117149675,567630,216240,373762.23534400004,181790,181790,137588,210936.82]
["CO-EX-29-03","Experto Junior en Inteligencia Artificial - zona 2","Servicios profesionales","NA","NA","Precio por hora","Hora","SI",330296,137848.22999999998,256435.20000000001,392200,379056,379527.7,345878,64719.360000000001,314899.58395200002,148084.12,162180,221646,372911.77959748649,567630,252280,560643.79832200008,247934,247934,137588,230113.28]
["CO-EX-29-04","Experto Junior en Inteligencia Artificial - zona 3","Servicios profesionales","NA","NA","Precio por hora","Hora","SI",342380,143739.18,282078.72000000003,402800,432056,397054.80000000005,345878,69848.063999999998,444820.418558,148084.12,162180,209032,823623.30198195321,630700,288320,1370461.529418,292772,292772,137588,249289.74000000002]
["CO-EX-30-01","Experto Senior en Inteligencia Artificial - remoto","Servicios profesionales","NA","NA","Precio por hora","Hora","SI",378632,142623,200340,381600,600458.33779999998,414042.36000000004,345878,80136,277270.07388400001,521913.26,252280,281960,249208.80176150365,455365.4,288320,498349.64709000004,189316,189316,332416,221724.44]
["CO-EX-30-02","Experto Senior en Inteligencia Artificial - zona 1","Servicios profesionales","NA","NA","Precio por hora","Hora","SI",443080,156885.30000000002,280476,434600,666708.3378000001,434803.52,519400,96163.200000000012,306977.58183799998,521913.26,324360,324360,318549.03597449849,630700,306340,622937.05883600004,256202,256202,332416,243896.46000000002]
["CO-EX-30-03","Experto Senior en Inteligencia Artificial - zona 2","Servicios profesionales","NA","NA","Precio por hora","Hora","SI",467248,166868.91,364618.80000000005,498200,761838.64199999999,455392.96,576534,113258.88,364412.09713800001,584496.72,216240,311746,457229.50440048828,630700,324360,934406.033666,317682,317682,332416,266068.48000000004]
["CO-EX-30-04","Experto Senior en Inteligencia Artificial - zona 3","Servicios profesionales","NA","NA","Precio por hora","Hora","SI",479332,174000.06,419311.62,508800,1005893.7946000001,476078.86000000004,576534,122234.11200000001,407190.90849,730525.5,180200,299132,907941.02678495506,693770,360400,1868811.1765079999,374816,374816,232988,288241.56]
["CO-EX-31-01","Experto Junior en Internet de las Cosas - remoto","Servicios profesionales","NA","NA","Precio por hora","Hora","SI",88616,186030,143100,254400,299556,156970.1,184546,45792,285192.07599799999,445421.54000000004,162180,101760,164891.07695850186,379681.4,180200,311468.97483000002,138860,138860,137588,191761.42]
["CO-EX-31-02","Experto Junior en Internet de las Cosas - zona 1","Servicios profesionales","NA","NA","Precio por hora","Hora","SI",153064,204633.00000000003,228960,307400,365806,164745.20000000001,277084,54950.400000000001,348568.09291000001,445421.54000000004,180200,144160,234231.31117149675,567630,216240,373762.23534400004,181790,181790,137588,210936.82]
["CO-EX-31-03","Experto Junior en Internet de las Cosas - zona 2","Servicios profesionales","NA","NA","Precio por hora","Hora","SI",177232,217655.1,256435.20000000001,371000,379056,172421.72,307506,64719.360000000001,411944.10982200003,541035.66,162180,131546,372911.77959748649,567630,252280,560643.79832200008,247934,247934,137588,230113.28]
["CO-EX-31-04","Experto Junior en Internet de las Cosas - zona 3","Servicios profesionales","NA","NA","Precio por hora","Hora","SI",189316,226956.6,282078.72000000003,381600,432056,180451.22,307506,69848.063999999998,475320.12662800006,619265.78,162180,118932,823623.30198195321,630700,288320,1370461.529418,292772,292772,137588,249289.74000000002]
["CO-EX-32-01","Experto Senior en Internet de las Cosas - remoto","Servicios profesionales","NA","NA","Precio por hora","Hora","SI",169176,235638,200340,360400,600458.33779999998,156970.1,318212,80136,411944.10982200003,521913.26,252280,281960,249208.80176150365,455365.4,288320,498349.64709000004,189316,189316,232988,221724.44]
["CO-EX-32-02","Experto Senior en Internet de las Cosas - zona 1","Servicios profesionales","NA","NA","Precio por hora","Hora","SI",233624,259201.80000000005,280476,413400,666708.3378000001,164745.20000000001,477848,96163.200000000012,475320.12662800006,521913.26,252280,324360,318549.03597449849,630700,324360,622937.05883600004,256202,256202,232988,243896.46000000002]
["CO-EX-32-03","Experto Senior en Internet de las Cosas - zona 2","Servicios profesionales","NA","NA","Precio por hora","Hora","SI",257792,275696.45999999996,364618.80000000005,477000,761838.64199999999,172421.72,530424,113258.88,570384.15199599997,584496.72,216240,311746,457229.50440048828,630700,360400,934406.033666,317682,317682,232988,266068.48000000004]
["CO-EX-32-04","Experto Senior en Internet de las Cosas - zona 3","Servicios profesionales","NA","NA","Precio por hora","Hora","SI",269876,287478.36,419311.62,487600,1005893.7946000001,180451.22,530424,122234.11200000001,697136.18582000001,730525.5,180200,299132,907941.02678495506,693770,432480,1868811.1765079999,374816,374816,232988,288241.56]
["CO-EX-33-01","Experto Junior en Gestión y Entrega de Contenido - remoto","Servicios profesionales","NA","NA","Precio por hora","Hora","SI",136952,124020,130777.5,190800,199704,156970.1,161438,34344,138635.03694200001,445421.54000000004,162180,101760,164891.07695850186,379681.4,165784,311468.97483000002,138860,138860,137588,191761.42]
["CO-EX-33-02","Experto Junior en Gestión y Entrega de Contenido - zona 1","Servicios profesionales","NA","NA","Precio por hora","Hora","SI",201400,136422.00000000003,260998.5,243800,265954,164745.20000000001,242422,41212.800000000003,168342.54489600001,445421.54000000004,180200,144160,234231.31117149675,567630,187408,373762.23534400004,181790,181790,137588,210936.82]
["CO-EX-33-03","Experto Junior en Gestión y Entrega de Contenido - zona 2","Servicios profesionales","NA","NA","Precio por hora","Hora","SI",225568,145103.4,291049.5,307400,279204,172421.72,269028,48539.520000000004,225777.06019600001,541035.66,162180,131546,372911.77959748649,567630,216240,560643.79832200008,247934,247934,137588,230113.28]
["CO-EX-33-04","Experto Junior en Gestión y Entrega de Contenido - zona 3","Servicios profesionales","NA","NA","Precio por hora","Hora","SI",237652,151304.4,321100.5,318000,332204,180451.22,269028,52386.048000000003,268555.87154800002,619265.78,162180,118932,823623.30198195321,630700,270300,1370461.529418,292772,292772,137588,249289.74000000002]
["CO-EX-34-01","Experto Senior en Gestión y Entrega de Contenido - remoto","Servicios profesionales","NA","NA","Precio por hora","Hora","SI",221540,148824,209244,296800,249630,156970.1,294044,51516,178245.04751200002,521913.26,252280,191860,249208.80176150365,455365.4,252280,498349.64709000004,189316,189316,232988,221724.44]
["CO-EX-34-02","Experto Senior en Gestión y Entrega de Contenido - zona 1","Servicios profesionales","NA","NA","Precio por hora","Hora","SI",285988,163706.4,339465,349800,315880,164745.20000000001,441490,61819.200000000004,207952.55546599999,521913.26,324360,234260,318549.03597449849,630700,273904,622937.05883600004,256202,256202,232988,243896.46000000002]
["CO-EX-34-03","Experto Senior en Gestión y Entrega de Contenido - zona 2","Servicios profesionales","NA","NA","Precio por hora","Hora","SI",310156,174124.08000000002,369516,413400,329130,172421.72,490038,72809.279999999999,295094.57861400006,584496.72,216240,221646,457229.50440048828,630700,306340,934406.033666,317682,317682,232988,266068.48000000004]
["CO-EX-34-04","Experto Senior en Gestión y Entrega de Contenido - zona 3","Servicios profesionales","NA","NA","Precio por hora","Hora","SI",322240,181565.28,399577.60000000003,424000,382130,180451.22,490038,78579.072,425015.41321999999,730525.5,180200,209032,907941.02678495506,693770,360400,1868811.1765079999,374816,374816,232988,288241.56]
["CO-EX-35-01","Experto Junior en Blockchain - remoto","Servicios profesionales","NA","NA","Precio por hora","Hora","SI",136952,186030,143100,275600,199704,345108.44,265212,51516,198050.05274400002,103064.86,162180,191860,164891.07695850186,379681.4,165784,311468.97483000002,151474,151474,137588,191761.42]
["CO-EX-35-02","Experto Junior en Blockchain - zona 1","Servicios profesionales","NA","NA","Precio por hora","Hora","SI",201400,204633.00000000003,228960,328600,265954,362084.34,398242,61819.200000000004,227757.56069800002,148084.12,180200,234260,234231.31117149675,567630,187408,373762.23534400004,214544,214544,137588,210936.82]
["CO-EX-35-03","Experto Junior en Blockchain - zona 2","Servicios profesionales","NA","NA","Precio por hora","Hora","SI",225568,217655.1,256435.20000000001,392200,279204,379527.7,442020,72809.279999999999,285192.07599799999,148084.12,162180,221646,372911.77959748649,567630,216240,560643.79832200008,269028,269028,137588,230113.28]
["CO-EX-35-04","Experto Junior en Blockchain - zona 3","Servicios profesionales","NA","NA","Precio por hora","Hora","SI",237652,226956.6,282078.72000000003,402800,332204,397054.80000000005,442020,78579.072,327970.88745600003,148084.12,162180,209032,823623.30198195321,630700,270300,1370461.529418,318000,318000,137588,249289.74000000002]
["CO-EX-36-01","Experto Senior en Blockchain - remoto","Servicios profesionales","NA","NA","Precio por hora","Hora","SI",237652,235638,200340,381600,600458.33779999998,436647.92000000004,345878,80136,277270.07388400001,521913.26,252280,281960,249208.80176150365,455365.4,252280,498349.64709000004,189316,189316,232988,221724.44]
["CO-EX-36-02","Experto Senior en Blockchain - zona 1","Servicios profesionales","NA","NA","Precio por hora","Hora","SI",302100,259201.80000000005,280476,434600,666708.3378000001,459340.4,519400,96163.200000000012,306977.58183799998,521913.26,252280,324360,318549.03597449849,630700,273904,622937.05883600004,256202,256202,232988,243896.46000000002]
["CO-EX-36-03","Experto Senior en Blockchain - zona 2","Servicios profesionales","NA","NA","Precio por hora","Hora","SI",326268,275696.45999999996,364618.80000000005,498200,761838.64199999999,480597.64,576534,113258.88,364412.09713800001,584496.72,216240,311746,457229.50440048828,630700,306340,934406.033666,317682,317682,232988,266068.48000000004]
["CO-EX-36-04","Experto Senior en Blockchain - zona 3","Servicios profesionales","NA","NA","Precio por hora","Hora","SI",338352,287478.36,419311.62,508800,1005893.7946000001,502566.14,576534,122234.11200000001,407190.90849,730525.5,180200,299132,907941.02678495506,693770,360400,1868811.1765079999,374816,374816,232988,288241.56]
["CO-MI-01","Servicio de Preparación para la migración","Servicios de migración","NA","NA","Precio por hora","Hora","SI",99844,117000,499800,180000,463150,148085,392000,108000,224207.60690000001,414102,170000,221000,139203.79094835199,429590,136000,470141.1765,178600,178600,109800,209174]
["CO-MI-02","Servicio de migración","Servicios de migración","NA","NA","Precio por hora","Hora","SI",113457,117000,499800,280000,235500,148085,392000,129600,298943.47590000002,329957,153000,386000,218748.81434741028,429590,204000,528909.24369999999,178600,178600,99800,209174]
["CO-SL-01-01","Almacenamiento para backup","Solución","Almacenamiento de 500 Gb","NA","Precio por almacenamiento/día","Dia","SI",768056,43332,597383,1767,598327,7224,2050,13570,102707.83560000001,326652,3588.8888999999999,1037739,37908.175213613707,39018000,765986,58768.067199999998,6280,2890,6533.333333333333,2676]
["CO-SL-01-02","Almacenamiento para backup","Solución","Almacenamiento de 500 Gb","NA","Precio por almacenamiento/mes","Mes","SI",3426802,1126620,2403604,53010,598327,212414,61600,407098,3124030,5145102,107666.6667,5084240,758163.50427227421,39018000,3172234,1704261.3444999999,188390,86460,196000,81377]
["CO-SL-01-03","Almacenamiento para backup","Solución","Almacenamiento de 1 TB","NA","Precio por almacenamiento/día","Dia","SI",1573010,79428,1221315,3534,598327,14437,3990,15270,211222.02739999999,513202,4776.6221999999998,2051374,75816.350427227415,39091500,1569100,88152.1008,11930,5480,13533.333333333334,6661]
["CO-SL-01-04","Almacenamiento para backup","Solución","Almacenamiento de 1 TB","NA","Precio por almacenamiento/mes","Mes","SI",7018106,2065140,4817753,106020,598327,429170,120300,458106,6424670,10150102,143298.6667,8193920,1516327.0085445484,39091500,6172598,2556392.4369999999,357720,164270,406000,202577]
["CO-SL-01-05","Almacenamiento para backup","Solución","Almacenamiento de 2 TB","NA","Precio por almacenamiento/día","Dia","SI",3146020,151622,2442631,7066.5,1196654,28560,7810,18595,422444.05479999998,781652,7097.6889000000001,4032387,151632.70085445483,77742000,3138472,117535.2941,23460,10570,27416.666666666668,12080]
["CO-SL-01-06","Almacenamiento para backup","Solución","Almacenamiento de 2 TB","NA","Precio por almacenamiento/mes","Mes","SI",14036212,3942180,9537506,211995,1196654,853767,234990,557842,12849340,17430102,212930.6667,14226800,3032654.0170890968,77742000,12171388,3408522.6891000001,703790,317040,822500,367377]
["CO-SL-01-07","Almacenamiento para backup","Solución","Almacenamiento de 5 TB","NA","Precio por almacenamiento/día","Dia","SI",7865050,368204,6106576,17664,2991635,70923,19280,28566,1044897.863,1741702,14060.8889,8362626,205845.64340541663,193686500,7585536,146919.32769999999,57960,25740,68016.666666666672,28340]
["CO-SL-01-08","Almacenamiento para backup","Solución","Almacenamiento de 5 TB","NA","Precio por almacenamiento/mes","Mes","SI",35090530,9573300,23696766,529920,2991635,2124436,579070,856973,31782310,43365102,421826.6667,32325440,4116912.8681083326,193686500,27556558,4260653.7814999996,1738740,772050,2040500,861822]
["CO-SL-02-01","Portal WordPress","Solución","Plataforma Tipo 1","NA","Precio por Portal/día","Dia","SI",107768,115906,10290,9757.5,1605168,12323,26440,67957.812699999995,65508.683299999997,13203326,76206.75,81236,21750.592335679998,2100000,401453.86670000001,352605.8824,152630,171130,63000,8865]
["CO-SL-02-02","Portal WordPress","Solución","Plataforma Tipo 1","NA","Precio por Portal/mes","Mes","SI",3233572,3013560,308700,292725,1605168,365396,794020,2038734.3816,1965260.5,13687971,2286202.5,2470930,435011.84671359992,2100000,2183616,10225568.067199999,4578850,5133670,1890000,269600]
["CO-SL-02-03","Portal WordPress","Solución","Plataforma Tipo 2","NA","Precio por Portal/día","Dia","SI",131100,132203,20580,19515,2097520,42461,52770,78221.234200000006,84443.683300000004,13199826,87138.883300000001,87283,30908.736477018945,2100000,410285.93329999998,646444.53780000005,169120,197820,66500,23064]
["CO-SL-02-04","Portal WordPress","Solución","Plataforma Tipo 2","NA","Precio por Portal/mes","Mes","SI",3933304,3437280,617400,585450,2097520,1270205,1584100,2346637.0247999998,2533310.5,13972326,2614166.5,2654855,618174.7295403789,2100000,2448578,18746873.9496,5073400,5934330,1995000,701377]
["CO-SL-03-01","Máquina virtual de uso general - Básica","Solución","Sistema operativo Windows","NA","Precio por Máquina/mes","Mes","SI",1010306,1754280,1559136,858870.00000000012,663168,781689,1659170,1051846.128,1138455.5,1231234,1035560.1,1185800,657423.91871754581,464870,713320,464215.12609999999,1008450,1599750,682500,753866]
["CO-SL-03-02","Máquina virtual de uso general - Básica","Solución","Sistema operativo Linux","NA","Precio por Máquina/mes","Mes","SI",1122330,1496880,1166773,965610,587808,534115,1187470,718130.36159999995,903395.5,1348379,777432.1,981400,520051.75659746159,409500,643620,311123.5294,748350,1336350,612500,731822]
["CO-SL-03-03","Máquina virtual de uso general - Básica","Solución","Sistema operativo Windows","NA","Precio por Máquina/día","Dia","SI",33668,67472,51971,28629.000000000004,663168,26182,55300,35061.537600000003,37428.673999999999,860234,34518.67,38985,32871.195935877287,464870,23777.333299999998,14974.7899,33620,90660,22750,24790]
["CO-SL-03-04","Máquina virtual de uso general - Básica","Solución","Sistema operativo Linux","NA","Precio por Máquina/día","Dia","SI",37544,57572,38892,32187,587808,17942,39580,23937.6787,29700.673999999999,863764,25914.403300000002,32265,26002.587829873079,409500,21454,10036.9748,24950,80190,20416.666666666668,24065]
["CO-SL-04-01","Máquina virtual de uso general - Moderada","Solución","Sistema operativo Windows","NA","Precio por Máquina/mes","Mes","SI",3315804,4839120,5022221,2987460,1155520,1524725,2341940,2968509.1680000001,1605310,1406234,3137453.7,3233510,982904.36150073202,807415,2312646,849415.12609999999,3064140,2151840,2572500,2422977]
["CO-SL-04-02","Máquina virtual de uso general - Moderada","Solución","Sistema operativo Linux","NA","Precio por Máquina/mes","Mes","SI",3484030,4328280,4149242,2942685,1004800,1031554,1618670,2449464.4512,1622565,1633734,2603067.2000000002,2824710,799741.47867395298,701155,2210578,548168.90760000004,2559910,1630860,2380000,2378844]
["CO-SL-04-03","Máquina virtual de uso general - Moderada","Solución","Sistema operativo Windows","NA","Precio por Máquina/día","Dia","SI",110542,186120,167407,99582,1155520,51020,78080,99079.113599999997,52777.3151,860234,104581.79,106307,49145.218075036602,807415,77088.2,27400.8403,102140,121940,85750,79677]
["CO-SL-04-04","Máquina virtual de uso general - Moderada","Solución","Sistema operativo Linux","NA","Precio por Máquina/día","Dia","SI",116128,166472,138308,98089.5,1004800,34476,54010,81648.815000000002,53344.602700000003,860234,86768.906700000007,92867,39987.073933697648,701155,73685.933300000004,17683.193299999999,85340,92420,79333.333333333328,78225]
["CO-SO-01-01","Soporte Complementario","Servicios profesionales","NA","NA","Precio por Hora","Hora","SI",120264.42000000001,325552.5,417375,159000,490939,156970.1,395804,57240,132861.65790200001,458949.26,126140,144160,147556.01840525313,455365.4,108120,539643.32773999998,189316,189316,335808,305280]
["CO-SO-01-02","Soporte Complementario","Servicios profesionales","NA","NA","Precio por Mes","Mes","SI",6042000,6511050,18550000,8480000,34615360,1569078.78,26118400,15660864,21257865.256370001,89008306,23065600,3922000,29511203.681050625,88272772,5406000,104658004.36979601,18928632,18928632,10483400,41518080]
["CO-SO-02-01","Soporte Premium","Servicios profesionales","NA","NA","Precio por Hora","Hora","SI",160230.66,651105,556500,265000,600458.33779999998,156970.1,544204,68688,180621.648178,458949.26,180200,234260,231873.74320825492,455365.4,360400,539643.32773999998,189316,189316,508800,351072]
["CO-SO-02-02","Soporte Premium","Servicios profesionales","NA","NA","Precio por Mes","Mes","SI",12084000,13022100,26712000,22260000,39940800,1569078.78,35912800,18793036.800000001,28899463.701802,89008306,34598400,6685023.5600000005,46374748.641650982,88272772,9010000,104658004.36979601,18928632,18928632,20614880,47745792]
["CO-NP-01","Servicios en la Nube","NA","NA","NA","Unidad","Und","No",{"$f":"SolCotizacion!$M$21","v":284525661.2992},{"$f":"SolCotizacion!$M$22","v":0},{"$f":"SolCotizacion!$M$21","v":284525661.2992},{"$f":"SolCotizacion!$M$21","v":284525661.2992},{"$f":"SolCotizacion!$M$25","v":0},{"$f":"SolCotizacion!$M$24","v":0},{"$f":"SolCotizacion!$M$24","v":0},{"$f":"SolCotizacion!$M$24","v":0},{"$f":"SolCotizacion!$M$24","v":0},{"$f":"SolCotizacion!$M$25","v":0},{"$f":"SolCotizacion!$M$22","v":0},{"$f":"SolCotizacion!$M$22","v":0},{"$f":"SolCotizacion!$M$21","v":284525661.2992},{"$f":"SolCotizacion!$M$25","v":0},{"$f":"SolCotizacion!$M$21","v":284525661.2992},{"$f":"SolCotizacion!$M$25","v":0},{"$f":"SolCotizacion!$M$21","v":284525661.2992},{"$f":"SolCotizacion!$M$24","v":0},{"$f":"SolCotizacion!$M$21","v":284525661.2992},{"$f":"SolCotizacion!$M$24","v":0}]

{"sheet":"temp","index":5,"n_rows":7,"n_cols":56,"rows_kept":7,"cut":false,"hidden":true,"merged":[]}
["Código del servicio","Nombre del servicio","Tipo de servicio","Característica 1","Característica 2","Unidad","Unidad TVEC","IVA","Avanxo - Segm 1. Amazon","Soluciones Orion - Segm 2. Google","UT Goldsvada - Segm 1. Amazon","Hightech - Segm 1. Amazon","UT Tecnologia Oracle Eficiente - Segm 5. Oracle","Colombia telecomunicaciones SA - Segm 4. Microsoft","Colsof - Segm 4. Microsoft","Mercanet SAS - Segm 4. Microsoft","Comcel - Segm 4. Microsoft","SETI - Segm 5. Oracle","Eforcers - Segm 2. Google","informacion localizada - Segm 2. Google","S3 SAS - Segm 1. Amazon","UT DPN 2019 - Segm 5. Oracle","UT Gestion integral cloud - Segm 1. Amazon","UT TAKWC - Segm 5. Oracle","UT Nubepublica2019 - Segm 1. Amazon","UT Nubepublica2019 - Segm 4. Microsoft","Clouxter - Segm 1. Amazon","Controles empresariales - Segm 4. Microsoft",null,null,"capacidad","cant en tiempo",{"$f":"\"V\"&I1","v":"VAvanxo - Segm 1. Amazon"},{"$f":"\"V\"&J1","v":"VSoluciones Orion - Segm 2. Google"},"VUT Goldsvada - Segm 1. Amazon","VHightech - Segm 1. Amazon","VUT Tecnologia Oracle Eficiente - Segm 5. Oracle","VColombia telecomunicaciones SA - Segm 4. Microsoft","VColsof - Segm 4. Microsoft","VMercanet SAS - Segm 4. Microsoft","VComcel - Segm 4. Microsoft","VSETI - Segm 5. Oracle","VEforcers - Segm 2. Google","Vinformacion localizada - Segm 2. Google","VS3 SAS - Segm 1. Amazon","VUT DPN 2019 - Segm 5. Oracle","VUT Gestion integral cloud - Segm 1. Amazon","VUT TAKWC - Segm 5. Oracle","VUT Nubepublica2019 - Segm 1. Amazon","VUT Nubepublica2019 - Segm 4. Microsoft","VClouxter - Segm 1. Amazon","VControles empresariales - Segm 4. Microsoft","vmin","v+grava","xcapacidad","total"]
["CO-GE-01","Tasa de intermediación para servicios autogestionados","Servicio de Computación en la Nube","NA","NA","Tasa","Und","SI",0.12,0.12,0.15,0.06,9.8000000000000004E-2,0.08,0,3.9E-2,5.0000000000000001E-4,0.12,0.01,0,1E-3,0.22,0.1,0.06,0.1,0.1,0.01,0.19,null,null,{"$f":"SUMIF(ResumenCotizacion!$C:$C,temp!A2,ResumenCotizacion!$J:$J)","v":1},{"$f":"SUMIF(ResumenCotizacion!$C:$C,temp!A2,ResumenCotizacion!$L:$L)","v":1},{"$f":"$AE2*$AF2*I2","v":0.12},{"$f":"$AE2*$AF2*J2","v":0.12},0.15,0.06,9.8000000000000004E-2,0.08,0,3.9E-2,5.0000000000000001E-4,0.12,0.01,0,1E-3,0.22,0.1,0.06,0.1,0.1,0.01,0.19,0.12,{"$f":"BA2/(1-VLOOKUP(\"Total porcentaje:\",ResumenCotizacion!$F:$G,2,0))","v":0.12448132780082988},{"$f":"ROUND(AE2*BB2,2)","v":0.12},{"$f":"ROUND(AF2*BC2,2)","v":0.12}]
["CO-MI-01","Servicio de Preparación para la migración","Servicios de migración","NA","NA","Precio por hora","Hora","SI",99844,117000,499800,180000,463150,148085,392000,108000,224207.60690000001,414102,170000,221000,139203.79094835199,429590,136000,470141.1765,178600,178600,109800,209174,null,null,{"$f":"SUMIF(ResumenCotizacion!$C:$C,temp!A3,ResumenCotizacion!$J:$J)","v":1},{"$f":"SUMIF(ResumenCotizacion!$C:$C,temp!A3,ResumenCotizacion!$L:$L)","v":2},{"$f":"$AE3*$AF3*I3","v":199688},{"$f":"$AE3*$AF3*J3","v":234000},{"$f":"$AE3*$AF3*K3","v":999600},{"$f":"$AE3*$AF3*L3","v":360000},{"$f":"$AE3*$AF3*M3","v":926300},{"$f":"$AE3*$AF3*N3","v":296170},{"$f":"$AE3*$AF3*O3","v":784000},{"$f":"$AE3*$AF3*P3","v":216000},{"$f":"$AE3*$AF3*Q3","v":448415.21380000003},{"$f":"$AE3*$AF3*R3","v":828204},{"$f":"$AE3*$AF3*S3","v":340000},{"$f":"$AE3*$AF3*T3","v":442000},{"$f":"$AE3*$AF3*U3","v":278407.58189670398},{"$f":"$AE3*$AF3*V3","v":859180},{"$f":"$AE3*$AF3*W3","v":272000},{"$f":"$AE3*$AF3*X3","v":940282.353},{"$f":"$AE3*$AF3*Y3","v":357200},{"$f":"$AE3*$AF3*Z3","v":357200},{"$f":"$AE3*$AF3*AA3","v":219600},{"$f":"$AE3*$AF3*AB3","v":418348},99844,{"$f":"BA3/(1-VLOOKUP(\"Total porcentaje:\",ResumenCotizacion!$F:$G,2,0))","v":103572.61410788383},{"$f":"ROUND(AE3*BB3,2)","v":103572.61},207145.22]
["CO-NP-01","Servicios en la Nube","NA","NA","NA","Unidad","Und","No",284525661.2992,0,284525661.2992,284525661.2992,0,0,0,0,0,0,0,0,284525661.2992,0,284525661.2992,0,284525661.2992,0,284525661.2992,0,null,null,{"$f":"SUMIF(ResumenCotizacion!$C:$C,temp!A4,ResumenCotizacion!$J:$J)","v":1},{"$f":"SUMIF(ResumenCotizacion!$C:$C,temp!A4,ResumenCotizacion!$L:$L)","v":1},284525661.2992,0,284525661.2992,284525661.2992,0,0,0,0,0,0,0,0,284525661.2992,0,284525661.2992,0,284525661.2992,0,284525661.2992,0,284525661.2992,{"$f":"BA4/(1-VLOOKUP(\"Total porcentaje:\",ResumenCotizacion!$F:$G,2,0))","v":295151100.93278009},{"$f":"ROUND(AE4*BB4,2)","v":295151100.93000001},295151100.93000001]
[null,null,null,null,null,null,null,null,null,null,null,null,null,null,null,null,null,null,null,null,null,null,null,null,null,null,null,null,null,null,null,null,{"$f":"IF(AND(AG$3:AG4>0),SUM(AG$3:AG4),0)","v":284725349.2992},{"$f":"IF(AND(AH$3:AH4>0),SUM(AH$3:AH4),0)","v":0},{"$f":"IF(AND(AI$3:AI4>0),SUM(AI$3:AI4),0)","v":285525261.2992},{"$f":"IF(AND(AJ$3:AJ4>0),SUM(AJ$3:AJ4),0)","v":284885661.2992},{"$f":"IF(AND(AK$3:AK4>0),SUM(AK$3:AK4),0)","v":0},{"$f":"IF(AND(AL$3:AL4>0),SUM(AL$3:AL4),0)","v":0},{"$f":"IF(AND(AM$3:AM4>0),SUM(AM$3:AM4),0)","v":0},{"$f":"IF(AND(AN$3:AN4>0),SUM(AN$3:AN4),0)","v":0},{"$f":"IF(AND(AO$3:AO4>0),SUM(AO$3:AO4),0)","v":0},{"$f":"IF(AND(AP$3:AP4>0),SUM(AP$3:AP4),0)","v":0},{"$f":"IF(AND(AQ$3:AQ4>0),SUM(AQ$3:AQ4),0)","v":0},{"$f":"IF(AND(AR$3:AR4>0),SUM(AR$3:AR4),0)","v":0},{"$f":"IF(AND(AS$3:AS4>0),SUM(AS$3:AS4),0)","v":284804068.88109672},{"$f":"IF(AND(AT$3:AT4>0),SUM(AT$3:AT4),0)","v":0},{"$f":"IF(AND(AU$3:AU4>0),SUM(AU$3:AU4),0)","v":284797661.2992},{"$f":"IF(AND(AV$3:AV4>0),SUM(AV$3:AV4),0)","v":0},{"$f":"IF(AND(AW$3:AW4>0),SUM(AW$3:AW4),0)","v":284882861.2992},{"$f":"IF(AND(AX$3:AX4>0),SUM(AX$3:AX4),0)","v":0},{"$f":"IF(AND(AY$3:AY4>0),SUM(AY$3:AY4),0)","v":284745261.2992},{"$f":"IF(AND(AZ$3:AZ4>0),SUM(AZ$3:AZ4),0)","v":0},null,null,null,{"$f":"SUM(BD$2:BD4)","v":295358246.26999998}]
[null,null,null,null,null,null,null,null,null,null,null,null,null,null,null,null,null,null,null,null,null,null,null,null,null,null,null,null,null,null,null,null,{"$f":"MIN(IF($AG5:$AV5<>0,$AG5:$AV5))","v":284725349.2992},{"$f":"MIN(IF($AG5:$AV5<>0,$AG5:$AV5))","v":284725349.2992},{"$f":"MIN(IF($AG5:$AV5<>0,$AG5:$AV5))","v":284725349.2992},{"$f":"MIN(IF($AG5:$AV5<>0,$AG5:$AV5))","v":284725349.2992},{"$f":"MIN(IF($AG5:$AV5<>0,$AG5:$AV5))","v":284725349.2992},{"$f":"MIN(IF($AG5:$AV5<>0,$AG5:$AV5))","v":284725349.2992},{"$f":"MIN(IF($AG5:$AV5<>0,$AG5:$AV5))","v":284725349.2992},{"$f":"MIN(IF($AG5:$AV5<>0,$AG5:$AV5))","v":284725349.2992},{"$f":"MIN(IF($AG5:$AV5<>0,$AG5:$AV5))","v":284725349.2992},{"$f":"MIN(IF($AG5:$AV5<>0,$AG5:$AV5))","v":284725349.2992},{"$f":"MIN(IF($AG5:$AV5<>0,$AG5:$AV5))","v":284725349.2992},{"$f":"MIN(IF($AG5:$AV5<>0,$AG5:$AV5))","v":284725349.2992},{"$f":"MIN(IF($AG5:$AV5<>0,$AG5:$AV5))","v":284725349.2992},{"$f":"MIN(IF($AG5:$AV5<>0,$AG5:$AV5))","v":284725349.2992},{"$f":"MIN(IF($AG5:$AV5<>0,$AG5:$AV5))","v":284725349.2992},{"$f":"MIN(IF($AG5:$AV5<>0,$AG5:$AV5))","v":284725349.2992},{"$f":"MIN(IF($AG5:$AV5<>0,$AG5:$AV5))","v":284725349.2992},{"$f":"MIN(IF($AG5:$AV5<>0,$AG5:$AV5))","v":284725349.2992},{"$f":"MIN(IF($AG5:$AV5<>0,$AG5:$AV5))","v":284725349.2992},{"$f":"MIN(IF($AG5:$AV5<>0,$AG5:$AV5))","v":284725349.2992},null,null,null,{"$f":"BD5*19%","v":56118066.791299999}]
[null,null,null,null,null,null,null,null,null,null,null,null,null,null,null,null,null,null,null,null,null,null,null,null,null,null,null,null,null,null,null,null,{"$f":"AG5=AG6","v":true},{"$f":"AH5=AH6","v":false},false,false,false,false,false,false,false,false,false,false,false,false,false,false,false,false,false,false,null,null,null,{"$f":"SUM(BD5:BD6)","v":351476313.06129998}]

{"sheet":"Servicios","index":6,"n_rows":211,"n_cols":23,"rows_kept":211,"cut":false,"hidden":true,"merged":[]}
["concatenar","Código (Colombia Compra Eficiente)","Categoría","Subcategoría","Nombre del servicio","Modalidad de entrega del servicio","Nombre software / manejador","Unidad de facturación","UnidadTVEC","Exento de IVA","Moneda","Columna Disponible 1","Columna Disponible 2","Itera","Colsof","Soluciones Orion","UT Eforcers Xertica","Información localizada","COEM","Colombia Telecomunicaciones","IFX","CenturyLink","Hightech"]
[{"$f":"SUBSTITUTE(C2&D2&E2&F2&G2&H2,\" \",\"\")","v":"ComplementariosComplementariosExpertosExpertoJuniorenRecuperacionanteDesastresN/AN/AHORA"},"IT-NPU-CO-EX-01","Complementarios","Complementarios Expertos","Experto Junior en Recuperacion ante Desastres","N/A","N/A","HORA",null,"NO","Peso Colombiano",null,null,86671.2,149767.83360000001,113498,478395.61769999994,251153.87698940001,107307.20000000001,105525.00000000001,155801.80000000002,83833.75,185724]
[{"$f":"SUBSTITUTE(C3&D3&E3&F3&G3&H3,\" \",\"\")","v":"ComplementariosComplementariosExpertosExpertoSeniorenRecuperacionanteDesastresN/AN/AHORA"},"IT-NPU-CO-EX-02","Complementarios","Complementarios Expertos","Experto Senior en Recuperacion ante Desastres","N/A","N/A","HORA",null,"NO","Peso Colombiano",null,null,166222.98000000001,239971.91680000001,153738.20000000001,545785.57110000006,331881.90898940002,176093.86670106,205187.5,163024.4,209584.375,288904]
["ComplementariosComplementariosExpertosExpertoJuniorenBackupyArchivadoN/AN/AHORA","IT-NPU-CO-EX-03","Complementarios","Complementarios Expertos","Experto Junior en Backup y Archivado","N/A","N/A","HORA",null,"NO","Peso Colombiano",null,null,86671.2,95832.552200000006,92862,309859.85800000001,251153.87698940001,107307.20000000001,105525.00000000001,123816,50300.25,185724]
["ComplementariosComplementariosExpertosExpertoSeniorenBackupyArchivadoN/AN/AHORA","IT-NPU-CO-EX-04","Complementarios","Complementarios Expertos","Experto Senior en Backup y Archivado","N/A","N/A","HORA",null,"NO","Peso Colombiano",null,null,166222.98000000001,160554.2708,143420.20000000001,580972.01470000006,331881.90898940002,176093.86670106,205187.5,131038.6,100600.5,288904]
["ComplementariosComplementariosExpertosExpertoJuniorenSeguridadenlaNubeN/AN/AHORA","IT-NPU-CO-EX-05","Complementarios","Complementarios Expertos","Experto Junior en Seguridad en la Nube","N/A","N/A","HORA",null,"NO","Peso Colombiano",null,null,86671.2,203702.08320000002,123816,309859.85800000001,251153.87698940001,176093.86670106,105525.00000000001,139293,67067,185724]
["ComplementariosComplementariosExpertosExpertoSeniorenSeguridadenlaNubeN/AN/AHORA","IT-NPU-CO-EX-06","Complementarios","Complementarios Expertos","Experto Senior en Seguridad en la Nube","N/A","N/A","HORA",null,"NO","Peso Colombiano",null,null,166222.98000000001,260920.55220000001,164056.20000000001,580972.01470000006,331881.90898940002,203608.53340212003,205187.5,145483.80000000002,117367.25,288904]
["ComplementariosComplementariosExpertosExpertoJuniorenMigracionN/AN/AHORA","IT-NPU-CO-EX-07","Complementarios","Complementarios Expertos","Experto Junior en Migracion","N/A","N/A","HORA",null,"NO","Peso Colombiano",null,null,86671.2,138980.3646,113498,416180.14129999996,219759.6430106,107307.20000000001,105525.00000000001,123816,67067,185724]
["ComplementariosComplementariosExpertosExpertoSeniorenMigracionN/AN/AHORA","IT-NPU-CO-EX-08","Complementarios","Complementarios Expertos","Experto Senior en Migracion","N/A","N/A","HORA",null,"NO","Peso Colombiano",null,null,166222.98000000001,182128.177,153738.20000000001,478395.61769999994,287033.00301060005,176093.86670106,205187.5,131038.6,167667.5,288904]
["ComplementariosComplementariosExpertosArquitectoJuniorenNubeHibridaN/AN/AHORA","IT-NPU-CO-EX-09","Complementarios","Complementarios Expertos","Arquitecto Junior en Nube Hibrida","N/A","N/A","HORA",null,"NO","Peso Colombiano",null,null,86671.2,138980.3646,123816,446679.11749999999,219759.6430106,176093.86670106,105525.00000000001,155801.80000000002,67067,247632]
["ComplementariosComplementariosExpertosArquitectoSeniorenNubeHibridaN/AN/AHORA","IT-NPU-CO-EX-10","Complementarios","Complementarios Expertos","Arquitecto Senior en Nube Hibrida","N/A","N/A","HORA",null,"NO","Peso Colombiano",null,null,166222.98000000001,239971.91680000001,164056.20000000001,682270.01150000002,287033.00301060005,203608.53340212003,205187.5,163024.4,167667.5,350812]
["ComplementariosComplementariosExpertosExpertoJuniorenBasesdeDatosN/AN/AHORA","IT-NPU-CO-EX-11","Complementarios","Complementarios Expertos","Experto Junior en Bases de Datos","N/A","N/A","HORA",null,"NO","Peso Colombiano",null,null,86671.2,154770,134134,343737.4633,219759.6430106,107307.20000000001,105525.00000000001,123816,50300.25,185724]
["ComplementariosComplementariosExpertosExpertoSeniorenBasesdeDatosN/AN/AHORA","IT-NPU-CO-EX-12","Complementarios","Complementarios Expertos","Experto Senior en Bases de Datos","N/A","N/A","HORA",null,"NO","Peso Colombiano",null,null,166222.98000000001,206360,174374.2,537902.10320000001,287033.00301060005,176093.86670106,205187.5,131038.6,134134,288904]
["ComplementariosComplementariosExpertosExpertoJuniorenServidoresyAplicacionesWebN/AN/AHORA","IT-NPU-CO-EX-13","Complementarios","Complementarios Expertos","Experto Junior en Servidores y Aplicaciones Web","N/A","N/A","HORA",null,"NO","Peso Colombiano",null,null,86671.2,160554.2708,92862,353782.03630000004,251153.87698940001,107307.20000000001,105525.00000000001,139293,50300.25,185724]
["ComplementariosComplementariosExpertosExpertoSeniorenServidoresyAplicacionesWebN/AN/AHORA","IT-NPU-CO-EX-14","Complementarios","Complementarios Expertos","Experto Senior en Servidores y Aplicaciones Web","N/A","N/A","HORA",null,"NO","Peso Colombiano",null,null,166222.98000000001,203702.08320000002,143420.20000000001,428872.82900000003,331881.90898940002,176093.86670106,205187.5,145483.80000000002,117367.25,288904]
["ComplementariosComplementariosExpertosExpertoJuniorenNubePúblicaN/AN/AHORA","IT-NPU-CO-EX-15","Complementarios","Complementarios Expertos","Experto Junior en Nube Pública","N/A","N/A","HORA",null,"NO","Peso Colombiano",null,null,86671.2,138980.3646,113498,446679.11749999999,219759.6430106,107307.20000000001,105525.00000000001,155801.80000000002,50300.25,185724]
["ComplementariosComplementariosExpertosExpertoSeniorenNubePúblicaN/AN/AHORA","IT-NPU-CO-EX-16","Complementarios","Complementarios Expertos","Experto Senior en Nube Pública","N/A","N/A","HORA",null,"NO","Peso Colombiano",null,null,166222.98000000001,239971.91680000001,153738.20000000001,682270.01150000002,287033.00301060005,176093.86670106,205187.5,163024.4,117367.25,288904]
["ComplementariosComplementariosExpertosExpertoJuniorenManejodeDatosN/AN/AHORA","IT-NPU-CO-EX-17","Complementarios","Complementarios Expertos","Experto Junior en Manejo de Datos","N/A","N/A","HORA",null,"NO","Peso Colombiano",null,null,86671.2,117406.4584,123816,220797.97740000003,219759.6430106,176093.86670106,340025,139293,83833.75,185724]
["ComplementariosComplementariosExpertosExpertoSeniorenManejodeDatosN/AN/AHORA","IT-NPU-CO-EX-18","Complementarios","Complementarios Expertos","Experto Senior en Manejo de Datos","N/A","N/A","HORA",null,"NO","Peso Colombiano",null,null,166222.98000000001,182128.177,164056.20000000001,382515.60270000005,331881.90898940002,203608.53340212003,351750,145483.80000000002,209584.375,288904]
["ComplementariosComplementariosGestiónySoporteHerramientadeMonitoreoySupervisiónAutogestionadoN/AMetricaoevento/Hora","IT-NPU-CO-GS-01-1","Complementarios","Complementarios Gestión y Soporte","Herramienta de Monitoreo y Supervisión","Autogestionado","N/A","Metrica o evento /Hora",null,"NO","USD",null,null,0.01,0.30409999999999998,0.05,1.0958904109589041E-2,3.8100000000000002E-2,9.4999999999999998E-3,1.4315789473684211,1.01E-2,4.4000000000000003E-3,1.8E-3]
["ComplementariosComplementariosGestiónySoporteHerramientadeMonitoreoySupervisiónGestionadoporelproveedorN/AMetricaoevento/Hora","IT-NPU-CO-GS-01-2","Complementarios","Complementarios Gestión y Soporte","Herramienta de Monitoreo y Supervisión","Gestionado por el proveedor","N/A","Metrica o evento /Hora",null,"NO","USD",null,null,0.01,0.32639999999999997,0.1,90.010958904109586,4.19E-2,9.7000000000000003E-3,2.8709728867623605,1.11E-2,4.4000000000000003E-3,2.5999999999999999E-3]
["ComplementariosComplementariosGestiónySoporteHerramientadeMonitoreoySupervisiónAutogestionadoN/AMetricaoevento/Mes","IT-NPU-CO-GS-01-3","Complementarios","Complementarios Gestión y Soporte","Herramienta de Monitoreo y Supervisión","Autogestionado","N/A","Metrica o evento /Mes",null,"NO","USD",null,null,4.3,110.9829,0.3,8,27.78,6.9058999999999999,1.4315789473684211,7.5427999999999997,3.2256,1.2349000000000001]
["ComplementariosComplementariosGestiónySoporteHerramientadeMonitoreoySupervisiónGestionadoporelproveedorN/AMetricaoevento/Mes","IT-NPU-CO-GS-01-4","Complementarios","Complementarios Gestión y Soporte","Herramienta de Monitoreo y Supervisión","Gestionado por el proveedor","N/A","Metrica o evento /Mes",null,"NO","USD",null,null,4.3,119.1037,0.5,360.0109589041096,30.558,7.0723000000000003,2.8709728867623605,8.2971000000000004,3.2256,1.8524]
["ComplementariosComplementariosGestiónySoporteHerramientasdeAutenticaciónMultifactorAutogestionadoN/AMétodoporUsuario/Mes","IT-NPU-CO-GS-02-1","Complementarios","Complementarios Gestión y Soporte","Herramientas de Autenticación Multifactor","Autogestionado","N/A","Método por Usuario/Mes",null,"NO","USD",null,null,55,10.220000000000001,3.3,4,6,1.4,2.1473684210526316,1.7,2.0999999999999999E-3,4.7000000000000002E-3]
["ComplementariosComplementariosGestiónySoporteHerramientasdeAutenticaciónMultifactorGestionadoporelproveedorN/AMétodoporUsuario/Mes","IT-NPU-CO-GS-02-2","Complementarios","Complementarios Gestión y Soporte","Herramientas de Autenticación Multifactor","Gestionado por el proveedor","N/A","Método por Usuario/Mes",null,"NO","USD",null,null,55,10.97,6.66,94,6.6,1.4338,3.586762360446571,1.87,1.5680000000000001,7.1000000000000004E-3]
["ComplementariosComplementariosGestiónySoporteSoportePremiumAutogestionadoN/AHora","IT-NPU-CO-GS-03-1","Complementarios","Complementarios Gestión y Soporte","Soporte Premium","Autogestionado","N/A","Hora",null,"NO","USD",null,null,20.49,90,4,90,22.4833,70.476200000000006,109.84848484848484,50,1.5342,11.77]
["ComplementariosComplementariosGestiónySoporteSoportePremiumGestionadoporelproveedorN/AHora","IT-NPU-CO-GS-03-2","Complementarios","Complementarios Gestión y Soporte","Soporte Premium","Gestionado por el proveedor","N/A","Hora",null,"NO","USD",null,null,20.49,90,6.72,90,26.98,70.476200000000006,124.24242424242424,45,1.5342,17.655000000000001]
["ComplementariosComplementariosGestiónySoporteSoportePremiumAutogestionadoN/AMes","IT-NPU-CO-GS-03-3","Complementarios","Complementarios Gestión y Soporte","Soporte Premium","Autogestionado","N/A","Mes",null,"NO","USD",null,null,14998.68,7181.2867000000006,3000,125.67,5396,9584.7620000000006,4393.939393939394,5000,1120,117.7]
["ComplementariosComplementariosGestiónySoporteSoportePremiumGestionadoporelproveedorN/AMes","IT-NPU-CO-GS-03-4","Complementarios","Complementarios Gestión y Soporte","Soporte Premium","Gestionado por el proveedor","N/A","Mes",null,"NO","USD",null,null,14998.68,7181.2867000000006,5000,125.67,6475.2,9584.7620000000006,4465.909090909091,4500,1120,176.55]
["ComplementariosComplementariosGestiónySoporteHerramientadeGestióndeLlavesdeEncriptaciónAutogestionadoN/ALlavedeencriptación/Hora","IT-NPU-CO-GS-04-1","Complementarios","Complementarios Gestión y Soporte","Herramienta de Gestión de Llaves de Encriptación","Autogestionado","N/A","Llave de encriptación/Hora",null,"NO","USD",null,null,2,1.2499999999999999E-2,0.97,0.06,5.0000000000000001E-4,6.8999999999999999E-3,1.0557894736842104,1E-4,1,1.18E-2]
["ComplementariosComplementariosGestiónySoporteHerramientadeGestióndeLlavesdeEncriptaciónGestionadoporelproveedorN/ALlavedeencriptación/Hora","IT-NPU-CO-GS-04-2","Complementarios","Complementarios Gestión y Soporte","Herramienta de Gestión de Llaves de Encriptación","Gestionado por el proveedor","N/A","Llave de encriptación/Hora",null,"NO","USD",null,null,2,1.3399999999999999E-2,1.57,90.06,5.0000000000000001E-4,7.1000000000000004E-3,2.4951834130781498,1E-4,1,1.77E-2]
["ComplementariosComplementariosGestiónySoporteHerramientadeGestióndeLlavesdeEncriptaciónAutogestionadoN/ALlavedeencriptación/Mes","IT-NPU-CO-GS-04-3","Complementarios","Complementarios Gestión y Soporte","Herramienta de Gestión de Llaves de Encriptación","Autogestionado","N/A","Llave de encriptación/Mes",null,"NO","USD",null,null,2.7000000000000001E-3,9.0909999999999993,6.97,1.7999999999999998,0.36,5,1.0557894736842104,3.6400000000000002E-2,3.4200000000000001E-2,8.2036999999999995]
["ComplementariosComplementariosGestiónySoporteHerramientadeGestióndeLlavesdeEncriptaciónGestionadoporelproveedorN/ALlavedeencriptación/Mes","IT-NPU-CO-GS-04-4","Complementarios","Complementarios Gestión y Soporte","Herramienta de Gestión de Llaves de Encriptación","Gestionado por el proveedor","N/A","Llave de encriptación/Mes",null,"NO","USD",null,null,2.7000000000000001E-3,9.7561,7.97,91.8,0.39600000000000002,5.1204999999999998,2.4951834130781498,4.0099999999999997E-2,3.4200000000000001E-2,12.3055]
["IaaSIaaSAlmacenamientoServiciodeAlmacenamientoAutogestionadoN/AGB/Hora","IT-NPU-IA-AL-01-1","IaaS","IaaS Almacenamiento","Servicio de Almacenamiento","Autogestionado","N/A","GB/Hora",null,"NO","USD",null,null,3.0999999999999999E-3,8.0000000000000004E-4,2.7974446614583332E-4,0.02,0.24,2.0000000000000001E-4,4.2105263157894743E-2,2.0000000000000001E-4,2.0000000000000001E-4,5.4999999999999997E-3]
["IaaSIaaSAlmacenamientoServiciodeAlmacenamientoGestionadoporelproveedorN/AGB/Hora","IT-NPU-IA-AL-01-2","IaaS","IaaS Almacenamiento","Servicio de Almacenamiento","Gestionado por el proveedor","N/A","GB/Hora",null,"NO","USD",null,null,3.0999999999999999E-3,9.0000000000000008E-4,3.3009847005208327E-4,90.02,0.26400000000000001,2.0000000000000001E-4,0.22202950558213719,2.0000000000000001E-4,2.0000000000000001E-4,8.3000000000000001E-3]
["IaaSIaaSAlmacenamientoServiciodeAlmacenamientoAutogestionadoN/AGB/Mes","IT-NPU-IA-AL-01-3","IaaS","IaaS Almacenamiento","Servicio de Almacenamiento","Autogestionado","N/A","GB/Mes",null,"NO","USD",null,null,2.3E-2,0.26079999999999998,0.201416015625,0.02,175.2,8.3299999999999999E-2,4.2105263157894743E-2,0.1336,0.12039999999999999,3.9723999999999999]
["IaaSIaaSAlmacenamientoServiciodeAlmacenamientoGestionadoporelproveedorN/AGB/Mes","IT-NPU-IA-AL-01-4","IaaS","IaaS Almacenamiento","Servicio de Almacenamiento","Gestionado por el proveedor","N/A","GB/Mes",null,"NO","USD",null,null,2.3E-2,0.27989999999999998,0.2376708984375,90.02,192.72,8.5000000000000006E-2,0.22202950558213719,0.1469,0.12039999999999999,5.9585999999999997]
["IaaSIaaSAlmacenamientoCopiadeRespaldoAutogestionadoN/AGB/Hora","IT-NPU-IA-AL-02-1","IaaS","IaaS Almacenamiento","Copia de Respaldo","Autogestionado","N/A","GB/Hora",null,"NO","USD",null,null,5.0000000000000001E-4,12.12,6.9444444444444444E-5,0.01,3.1459999999999999,1E-4,2.6842105263157893E-2,8.2000000000000007E-3,2.0000000000000001E-4,4.0000000000000002E-4]
["IaaSIaaSAlmacenamientoCopiadeRespaldoGestionadoporelproveedorN/AGB/Hora","IT-NPU-IA-AL-02-2","IaaS","IaaS Almacenamiento","Copia de Respaldo","Gestionado por el proveedor","N/A","GB/Hora",null,"NO","USD",null,null,5.0000000000000001E-4,13.01,8.1944444444444437E-5,90.01,3.4605999999999999,1E-4,0.20676634768740032,9.1000000000000004E-3,2.0000000000000001E-4,5.0000000000000001E-4]
["IaaSIaaSAlmacenamientoCopiadeRespaldoAutogestionadoN/AGB/Mes","IT-NPU-IA-AL-02-3","IaaS","IaaS Almacenamiento","Copia de Respaldo","Autogestionado","N/A","GB/Mes",null,"NO","USD",null,null,4.0000000000000001E-3,12.12,0.05,0.01,109.58,4.2099999999999999E-2,2.6842105263157893E-2,6.1285999999999996,0.1389,0.1648]
["IaaSIaaSAlmacenamientoCopiadeRespaldoGestionadoporelproveedorN/AGB/Mes","IT-NPU-IA-AL-02-4","IaaS","IaaS Almacenamiento","Copia de Respaldo","Gestionado por el proveedor","N/A","GB/Mes",null,"NO","USD",null,null,4.0000000000000001E-3,13.01,5.8999999999999997E-2,90.01,120.538,4.2999999999999997E-2,0.20676634768740032,6.7413999999999996,0.1389,0.2472]
["IaaSIaaSProcesamientoServidoresVirtualesAutogestionadoDebianServidorVirtual/Hora","IT-NPU-IA-PR-01-1","IaaS","IaaS Procesamiento","Servidores Virtuales","Autogestionado","Debian","Servidor Virtual / Hora",null,"NO","USD",null,null,3.2,5.8488999999999995,4.6079999999999997,3.87,4.2516999999999996,23.381499999999999,202.76332804614276,6.7586000000000004,6.1429999999999998,12.3546]
["IaaSIaaSProcesamientoServidoresVirtualesAutogestionadoSUSELinuxEnterpriseServidorVirtual/Hora","IT-NPU-IA-PR-01-2","IaaS","IaaS Procesamiento","Servidores Virtuales","Autogestionado","SUSE Linux Enterprise","Servidor Virtual / Hora",null,"NO","USD",null,null,3.3,5.8488999999999995,4.7080000000000002,3.87,14.8117,23.381499999999999,202.76332804614276,7.2157,6.1429999999999998,12.472300000000001]
["IaaSIaaSProcesamientoServidoresVirtualesAutogestionadoUbuntuServidorVirtual/Hora","IT-NPU-IA-PR-01-3","IaaS","IaaS Procesamiento","Servidores Virtuales","Autogestionado","Ubuntu","Servidor Virtual / Hora",null,"NO","USD",null,null,3.2,5.8636999999999997,4.6079999999999997,3.87,4.2516999999999996,23.381499999999999,202.76332804614276,6.7586000000000004,6.1463000000000001,12.3546]
["IaaSIaaSProcesamientoServidoresVirtualesAutogestionadoRedHatEnterpriseServidorVirtual/Hora","IT-NPU-IA-PR-01-4","IaaS","IaaS Procesamiento","Servidores Virtuales","Autogestionado","RedHat Enterprise","Servidor Virtual / Hora",null,"NO","USD",null,null,3.33,6.0411000000000001,4.7380000000000004,4,16.7317,23.381499999999999,202.87964383561643,6.9164000000000003,6.5797999999999996,12.5076]
["IaaSIaaSProcesamientoServidoresVirtualesAutogestionadoWindowsServerServidorVirtual/Hora","IT-NPU-IA-PR-01-5","IaaS","IaaS Procesamiento","Servidores Virtuales","Autogestionado","Windows Server","Servidor Virtual / Hora",null,"NO","USD",null,null,3.84,10.172699999999999,9.0239999999999991,7.71,8.0916999999999994,31.381499999999999,205.11386301369862,12.1229,11.088900000000001,17.552199999999999]
["IaaSIaaSProcesamientoServidoresVirtualesAutogestionadoWindowsServerDatacenterServidorVirtual/Hora","IT-NPU-IA-PR-01-6","IaaS","IaaS Procesamiento","Servidores Virtuales","Autogestionado","Windows Server Datacenter","Servidor Virtual / Hora",null,"NO","USD",null,null,3.84,10.172699999999999,9.0239999999999991,7.71,8.0916999999999994,31.381499999999999,205.11386301369862,12.1229,11.088900000000001,17.552199999999999]
["IaaSIaaSProcesamientoServidoresVirtualesGestionadoporelproveedorDebianServidorVirtual/Hora","IT-NPU-IA-PR-01-7","IaaS","IaaS Procesamiento","Servidores Virtuales","Gestionado por el proveedor","Debian","Servidor Virtual / Hora",null,"NO","USD",null,null,3.2,6.2797999999999998,5.4374399999999996,93.87,4.6768999999999998,23.873699999999999,204.2027219855367,7.3178999999999998,6.2606000000000002,18.5319]
["IaaSIaaSProcesamientoServidoresVirtualesGestionadoporelproveedorSUSELinuxEnterpriseServidorVirtual/Hora","IT-NPU-IA-PR-01-8","IaaS","IaaS Procesamiento","Servidores Virtuales","Gestionado por el proveedor","SUSE Linux Enterprise","Servidor Virtual / Hora",null,"NO","USD",null,null,3.3,6.2797999999999998,5.5554399999999999,93.87,16.292899999999999,23.873699999999999,274.73302501583976,7.8207000000000004,6.2606000000000002,18.708400000000001]
["IaaSIaaSProcesamientoServidoresVirtualesGestionadoporelproveedorUbuntuServidorVirtual/Hora","IT-NPU-IA-PR-01-9","IaaS","IaaS Procesamiento","Servidores Virtuales","Gestionado por el proveedor","Ubuntu","Servidor Virtual / Hora",null,"NO","USD",null,null,3.2,6.2924999999999995,5.4374399999999996,93.87,4.6768999999999998,23.873699999999999,204.2027219855367,7.3178999999999998,6.2638999999999996,18.5319]
["IaaSIaaSProcesamientoServidoresVirtualesGestionadoporelproveedorRedHatEnterpriseServidorVirtual/Hora","IT-NPU-IA-PR-01-10","IaaS","IaaS Procesamiento","Servidores Virtuales","Gestionado por el proveedor","RedHat Enterprise","Servidor Virtual / Hora",null,"NO","USD",null,null,3.33,6.4847000000000001,5.59084,94,18.404900000000001,23.873699999999999,204.31903777501037,7.4915000000000003,6.6974,18.761399999999998]
["IaaSIaaSProcesamientoServidoresVirtualesGestionadoporelproveedorWindowsServerServidorVirtual/Hora","IT-NPU-IA-PR-01-11","IaaS","IaaS Procesamiento","Servidores Virtuales","Gestionado por el proveedor","Windows Server","Servidor Virtual / Hora",null,"NO","USD",null,null,3.84,10.920500000000001,10.648319999999998,97.71,8.9009,32.042200000000001,206.55325695309256,13.2186,11.2065,26.328299999999999]
["IaaSIaaSProcesamientoServidoresVirtualesGestionadoporelproveedorWindowsServerDatacenterServidorVirtual/Hora","IT-NPU-IA-PR-01-12","IaaS","IaaS Procesamiento","Servidores Virtuales","Gestionado por el proveedor","Windows Server Datacenter","Servidor Virtual / Hora",null,"NO","USD",null,null,3.84,10.920500000000001,10.648319999999998,97.71,8.9009,32.042200000000001,206.55325695309256,13.2186,11.2065,26.328299999999999]
["IaaSIaaSProcesamientoServidoresVirtualesAutogestionadoDebianServidorVirtual/Mes","IT-NPU-IA-PR-01-13","IaaS","IaaS Procesamiento","Servidores Virtuales","Autogestionado","Debian","Servidor Virtual / Mes",null,"NO","USD",null,null,2342.4,4211.1875,3317.7599999999998,2828,2191.1999999999998,17395.793900000001,2217.2294736842109,5028.38,5022.4930999999997,9043.5619000000006]
["IaaSIaaSProcesamientoServidoresVirtualesAutogestionadoSUSELinuxEnterpriseServidorVirtual/Mes","IT-NPU-IA-PR-01-14","IaaS","IaaS Procesamiento","Servidores Virtuales","Autogestionado","SUSE Linux Enterprise","Servidor Virtual / Mes",null,"NO","USD",null,null,2415.6,4211.1875,3389.76,2828,2271.5,17395.793900000001,2217.2294736842109,5368.4943000000003,5022.4930999999997,9129.7183000000005]
["IaaSIaaSProcesamientoServidoresVirtualesAutogestionadoUbuntuServidorVirtual/Mes","IT-NPU-IA-PR-01-15","IaaS","IaaS Procesamiento","Servidores Virtuales","Autogestionado","Ubuntu","Servidor Virtual / Mes",null,"NO","USD",null,null,2342.4,4221.8333000000002,3317.7599999999998,2828,2191.1999999999998,17395.793900000001,2217.2294736842109,5028.38,5047.5811000000003,9043.5619000000006]
["IaaSIaaSProcesamientoServidoresVirtualesAutogestionadoRedHatEnterpriseServidorVirtual/Mes","IT-NPU-IA-PR-01-16","IaaS","IaaS Procesamiento","Servidores Virtuales","Autogestionado","RedHat Enterprise","Servidor Virtual / Mes",null,"NO","USD",null,null,2437.56,4349.5833000000002,3411.36,2922.9,2382.1,17395.793900000001,2302.14,5145.8257000000003,4803.2327999999998,9155.5651999999991]
["IaaSIaaSProcesamientoServidoresVirtualesAutogestionadoWindowsServerServidorVirtual/Mes","IT-NPU-IA-PR-01-17","IaaS","IaaS Procesamiento","Servidores Virtuales","Autogestionado","Windows Server","Servidor Virtual / Mes",null,"NO","USD",null,null,2810.88,7324.3333000000002,6497.28,5631.2,4994.3999999999996,23347.793900000001,4140.1263157894737,9019.4086000000007,8094.8904000000002,12848.226199999999]
["IaaSIaaSProcesamientoServidoresVirtualesAutogestionadoWindowsServerDatacenterServidorVirtual/Mes","IT-NPU-IA-PR-01-18","IaaS","IaaS Procesamiento","Servidores Virtuales","Autogestionado","Windows Server Datacenter","Servidor Virtual / Mes",null,"NO","USD",null,null,2810.88,7324.3333000000002,6497.28,5631.2,4994.3999999999996,23347.793900000001,4140.1263157894737,9019.4086000000007,9066.2772000000004,12848.226199999999]
["IaaSIaaSProcesamientoServidoresVirtualesGestionadoporelproveedorDebianServidorVirtual/Mes","IT-NPU-IA-PR-01-19","IaaS","IaaS Procesamiento","Servidores Virtuales","Gestionado por el proveedor","Debian","Servidor Virtual / Mes",null,"NO","USD",null,null,2342.4,4521.4375,3914.9567999999999,3188,2410.3200000000002,17762.021100000002,2289.1991706539079,5444.4885999999997,4570.3688000000002,13565.3428]
["IaaSIaaSProcesamientoServidoresVirtualesGestionadoporelproveedorSUSELinuxEnterpriseServidorVirtual/Mes","IT-NPU-IA-PR-01-20","IaaS","IaaS Procesamiento","Servidores Virtuales","Gestionado por el proveedor","SUSE Linux Enterprise","Servidor Virtual / Mes",null,"NO","USD",null,null,2415.6,4521.4375,3999.9168,3188,2498.65,17762.021100000002,2289.1991706539079,5818.6143000000002,4570.3688000000002,13694.5774]
["IaaSIaaSProcesamientoServidoresVirtualesGestionadoporelproveedorUbuntuServidorVirtual/Mes","IT-NPU-IA-PR-01-21","IaaS","IaaS Procesamiento","Servidores Virtuales","Gestionado por el proveedor","Ubuntu","Servidor Virtual / Mes",null,"NO","USD",null,null,2342.4,4530.5625,3914.9567999999999,3188,2410.3200000000002,17762.021100000002,2289.1991706539079,5444.4885999999997,4592.7687999999998,13565.3428]
["IaaSIaaSProcesamientoServidoresVirtualesGestionadoporelproveedorRedHatEnterpriseServidorVirtual/Mes","IT-NPU-IA-PR-01-22","IaaS","IaaS Procesamiento","Servidores Virtuales","Gestionado por el proveedor","RedHat Enterprise","Servidor Virtual / Mes",null,"NO","USD",null,null,2437.56,4668.9583000000002,4025.4048000000003,3282.9,2620.31,17762.021100000002,2374.1096969696969,5573.6788999999999,4889.2327999999998,13733.3478]
["IaaSIaaSProcesamientoServidoresVirtualesGestionadoporelproveedorWindowsServerServidorVirtual/Mes","IT-NPU-IA-PR-01-23","IaaS","IaaS Procesamiento","Servidores Virtuales","Gestionado por el proveedor","Windows Server","Servidor Virtual / Mes",null,"NO","USD",null,null,2810.88,7862.7083000000002,7666.790399999999,5991.2,5493.84,23839.326400000002,4212.0960127591707,9834.6200000000008,8180.8904000000002,19272.339199999999]
["IaaSIaaSProcesamientoServidoresVirtualesGestionadoporelproveedorWindowsServerDatacenterServidorVirtual/Mes","IT-NPU-IA-PR-01-24","IaaS","IaaS Procesamiento","Servidores Virtuales","Gestionado por el proveedor","Windows Server Datacenter","Servidor Virtual / Mes",null,"NO","USD",null,null,2810.88,7862.7083000000002,7666.790399999999,5991.2,5493.84,23839.326400000002,4212.0960127591707,9834.6200000000008,8180.8904000000002,19272.339199999999]
["IaaSIaaSProcesamientoIPPúblicasAutogestionadoN/AIP/Hora","IT-NPU-IA-PR-02-1","IaaS","IaaS Procesamiento","IP Públicas","Autogestionado","N/A","IP/Hora",null,"NO","USD",null,null,0.01,7.8899999999999998E-2,5.0833333333333338E-3,1E-4,0.01,4.4000000000000003E-3,7.2000000000000008E-2,7.1000000000000004E-3,4.0000000000000001E-3,6.0000000000000001E-3]
[{"$f":"SUBSTITUTE(C67&D67&E67&F67&G67&H67,\" \",\"\")","v":"IaaSIaaSProcesamientoIPPúblicasGestionadoporelproveedorN/AIP/Hora"},"IT-NPU-IA-PR-02-2","IaaS","IaaS Procesamiento","IP Públicas","Gestionado por el proveedor","N/A","IP/Hora",null,"NO","USD",null,null,0.01,8.4600000000000009E-2,5.9983333333333329E-3,1E-4,1.0999999999999999E-2,4.4999999999999997E-3,0.25192424242424244,7.9000000000000008E-3,4.0000000000000001E-3,8.9999999999999993E-3]
["IaaSIaaSProcesamientoIPPúblicasAutogestionadoN/AIP/Mes","IT-NPU-IA-PR-02-3","IaaS","IaaS Procesamiento","IP Públicas","Autogestionado","N/A","IP/Mes",null,"NO","USD",null,null,3.66,56.738199999999999,3.66,1E-4,7.3,3.2597999999999998,52.56,5.3143000000000002,2.9434,4.3078000000000003]
["IaaSIaaSProcesamientoIPPúblicasGestionadoporelproveedorN/AIP/Mes","IT-NPU-IA-PR-02-4","IaaS","IaaS Procesamiento","IP Públicas","Gestionado por el proveedor","N/A","IP/Mes",null,"NO","USD",null,null,3.66,60.8902,4.3187999999999995,1E-4,8.0299999999999994,3.3285,53.279696969696971,5.8456999999999999,2.9434,6.4617000000000004]
["IaaSIaaSProcesamientoContenedoresAutogestionadoN/AContenedor/Mes","IT-NPU-IA-PR-03-1","IaaS","IaaS Procesamiento","Contenedores","Autogestionado","N/A","Contenedor/Mes",null,"NO","USD",null,null,119.54,4852.6145000000006,6497.28,2828,906.54240000000004,17399.474300000002,54.191526315789474,229.13,3767.5007999999998,23480.302599999999]
["IaaSIaaSProcesamientoContenedoresGestionadoporelproveedorN/AContenedor/Mes","IT-NPU-IA-PR-03-2","IaaS","IaaS Procesamiento","Contenedores","Gestionado por el proveedor","N/A","Contenedor/Mes",null,"NO","USD",null,null,119.54,5061.3424000000005,7666.790399999999,2960.81,997.19659999999999,17765.778999999999,68.585465709728865,229.13,3767.5007999999998,35220.453800000003]
["IaaSIaaSRedesDomainNameServerAutogestionadoN/ADNS/Mes","IT-NPU-IA-RE-01-1","IaaS","IaaS Redes","Domain Name Server","Autogestionado","N/A","DNS/Mes",null,"NO","USD",null,null,0.7,398.44319999999999,3203.75,5,405,17701.298999999999,369.07894736842098,3.83,462,471.38850000000002]
["IaaSIaaSRedesDomainNameServerGestionadoporelproveedorN/ADNS/Mes","IT-NPU-IA-RE-01-2","IaaS","IaaS Redes","Domain Name Server","Gestionado por el proveedor","N/A","DNS/Mes",null,"NO","USD",null,null,0.7,427.59750000000003,3780.4249999999997,95,445,18073.957900000001,441.04864433811792,3.83,462,707.08280000000002]
["IaaSIaaSRedesRedPrivadaVirtualAutogestionadoN/ANRPV/Mes","IT-NPU-IA-RE-02-1","IaaS","IaaS Redes","Red Privada Virtual","Autogestionado","N/A","NRPV/Mes",null,"NO","USD",null,null,0.05,25.386299999999999,0.3,36.5,36.51,814.94849999999997,23.515789473684212,1129.2856999999999,2.2400000000000002,43.078200000000002]
["IaaSIaaSRedesRedPrivadaVirtualGestionadoporelproveedorN/ANRPV/Mes","IT-NPU-IA-RE-02-2","IaaS","IaaS Redes","Red Privada Virtual","Gestionado por el proveedor","N/A","NRPV/Mes",null,"NO","USD",null,null,0.05,27.2439,10,73,40.161000000000001,832.10530000000006,37.909728867623606,1242.2143000000001,2.2400000000000002,64.6173]
["IaaSIaaSRedesConexiónparaNubeHíbridaAutogestionadoN/AGB/Hora","IT-NPU-IA-RE-03-1","IaaS","IaaS Redes","Conexión para Nube Híbrida","Autogestionado","N/A","GB/Hora",null,"NO","USD",null,null,0.05,2.8940000000000001,28.46,36.5,0.17100000000000001,3.5000000000000003E-2,1.8300064888248022,0.2482,3.8959000000000001,2.7799999999999998E-2]
["IaaSIaaSRedesConexiónparaNubeHíbridaGestionadoporelproveedorN/AGB/Hora","IT-NPU-IA-RE-03-2","IaaS","IaaS Redes","Conexión para Nube Híbrida","Gestionado por el proveedor","N/A","GB/Hora",null,"NO","USD",null,null,0.05,3.1021000000000001,35.25,73,0.18809999999999999,3.5900000000000001E-2,2.1898549736732873,0.27300000000000002,3.8959000000000001,4.1700000000000001E-2]
["IaaSIaaSRedesConexiónparaNubeHíbridaAutogestionadoN/AGB/Mes","IT-NPU-IA-RE-03-3","IaaS","IaaS Redes","Conexión para Nube Híbrida","Autogestionado","N/A","GB/Mes",null,"NO","USD",null,null,36.6,2076.12,63.51,36.5,37.35,26.04,1335.9047368421056,184.67140000000001,2844.0194000000001,20]
["IaaSIaaSRedesConexiónparaNubeHíbridaGestionadoporelproveedorN/AGB/Mes","IT-NPU-IA-RE-03-4","IaaS","IaaS Redes","Conexión para Nube Híbrida","Gestionado por el proveedor","N/A","GB/Mes",null,"NO","USD",null,null,36.6,2228.0300000000002,78.510000000000005,73,41.085000000000001,26.6675,1407.8744338118026,203.1386,2844.0194000000001,30]
["IaaSIaaSRedesCargaDescargadeDatosenlaNubeAutogestionadoN/AGBtransferidos","IT-NPU-IA-RE-04-1","IaaS","IaaS Redes","Carga Descarga de Datos en la Nube","Autogestionado","N/A","GB transferidos",null,"NO","USD",null,null,0.01,0.43290000000000001,0.01,0.12,380.4667,8.6999999999999994E-2,1.5881424337199999E-2,9.4299999999999995E-2,5.6000000000000001E-2,3.5310000000000001]
["IaaSIaaSRedesCargaDescargadeDatosenlaNubeGestionadoporelproveedorN/AGBtransferidos","IT-NPU-IA-RE-04-2","IaaS","IaaS Redes","Carga Descarga de Datos en la Nube","Gestionado por el proveedor","N/A","GB transferidos",null,"NO","USD",null,null,0.01,0.45119999999999999,0.21,90.12,418.51130000000001,8.9099999999999999E-2,0.19580566676144243,0.1037,5.6000000000000001E-2,5.2965]
["IaaSIaaSRedesBalanceadorCargaAplicacionesAutogestionadoN/AUso/Hora","IT-NPU-IA-RE-05-1","IaaS","IaaS Redes","Balanceador Carga Aplicaciones","Autogestionado","N/A","Uso/Hora",null,"NO","USD",null,null,0.03,1.7787999999999999,2.2499999999999999E-2,2.5000000000000001E-2,0.183,2.5000000000000001E-2,314.72368421052636,0.64749999999999996,2.8000000000000001E-2,6.6000000000000003E-2]
["IaaSIaaSRedesBalanceadorCargaAplicacionesGestionadoporelproveedorN/AUso/Hora","IT-NPU-IA-RE-05-2","IaaS","IaaS Redes","Balanceador Carga Aplicaciones","Gestionado por el proveedor","N/A","Uso/Hora",null,"NO","USD",null,null,0.03,2.0330000000000004,2.6549999999999997E-2,90.025000000000006,0.20130000000000001,2.5700000000000001E-2,386.69338118022335,0.64749999999999996,2.8000000000000001E-2,9.9000000000000005E-2]
["IaaSIaaSRedesTransferenciaDatosenlaNubeAutogestionadoN/AGB/Mes","IT-NPU-IA-RE-06-1","IaaS","IaaS Redes","Transferencia Datos en la Nube","Autogestionado","N/A","GB/Mes",null,"NO","USD",null,null,4.41,3.9800000000000002E-2,4830.2908333333335,1E-4,0.12,8.6999999999999994E-2,3.2090882105263202E-2,0.17,9.74E-2,0.10589999999999999]
["IaaSIaaSRedesTransferenciaDatosenlaNubeGestionadoporelproveedorN/AGB/Mes","IT-NPU-IA-RE-06-2","IaaS","IaaS Redes","Transferencia Datos en la Nube","Gestionado por el proveedor","N/A","GB/Mes",null,"NO","USD",null,null,4.41,4.2700000000000002E-2,5699.743183333333,1E-4,0.13300000000000001,8.9099999999999999E-2,0.21201512452950563,0.17,9.74E-2,0.15890000000000001]
["IaaSIaaSRedesEntregaContenidosAutogestionadoN/ATB/Mes","IT-NPU-IA-RE-07-1","IaaS","IaaS Redes","Entrega Contenidos","Autogestionado","N/A","TB/Mes",null,"NO","USD",null,null,0.08,356.07279999999997,2590.7175000000002,0.15250000000000002,8.2943999999999996,152.54640000000001,39.4,310.8571,100.8,197.14750000000001]
["IaaSIaaSRedesEntregaContenidosGestionadoporelproveedorN/ATB/Mes","IT-NPU-IA-RE-07-2","IaaS","IaaS Redes","Entrega Contenidos","Gestionado por el proveedor","N/A","TB/Mes",null,"NO","USD",null,null,0.08,382.12689999999998,3057.0466500000002,90.152499999999989,9.1237999999999992,155.75790000000001,53.793939393939397,341.94290000000001,100.8,295.72129999999999]
["PaaSPaaSBasesdeDatosPaaSBasesdeDatosAutogestionadoSQLServerstandardPaaS/Hora","IT-NPU-PA-BD-01-1","PaaS","PaaS Bases de Datos","PaaS Bases de Datos","Autogestionado","SQL Server standard","PaaS/Hora",null,"NO","USD",null,null,12.08,12.7926,440.13,22.77,25.786100000000001,26.288699999999999,46.651123587599137,12.242800000000001,15.715999999999999,53.738399999999999]
["PaaSPaaSBasesdeDatosPaaSBasesdeDatosGestionadoporelproveedorSQLServerstandardPaaS/Hora","IT-NPU-PA-BD-01-2","PaaS","PaaS Bases de Datos","PaaS Bases de Datos","Gestionado por el proveedor","SQL Server standard","PaaS/Hora",null,"NO","USD",null,null,12.08,13.7286,480.13,112.77,28.364699999999999,26.842199999999998,61.045062981538535,13.4671,14.15,80.607600000000005]
["PaaSPaaSBasesdeDatosPaaSBasesdeDatosAutogestionadoSQLserverEnterprisePaaS/Hora","IT-NPU-PA-BD-01-3","PaaS","PaaS Bases de Datos","PaaS Bases de Datos","Autogestionado","SQL server Enterprise","PaaS/Hora",null,"NO","USD",null,null,37.369999999999997,29.7926,484.53,45.28,48.298099999999998,26.288699999999999,48.950368317231437,44.3,37.793500000000002,97.214399999999998]
["PaaSPaaSBasesdeDatosPaaSBasesdeDatosGestionadoporelproveedorSQLserverEnterprisePaaS/Hora","IT-NPU-PA-BD-01-4","PaaS","PaaS Bases de Datos","PaaS Bases de Datos","Gestionado por el proveedor","SQL server Enterprise","PaaS/Hora",null,"NO","USD",null,null,37.369999999999997,31.9725,524.53,135.28,53.127899999999997,26.842199999999998,63.344307711170828,48.73,33.862000000000002,145.82159999999999]
["PaaSPaaSBasesdeDatosPaaSBasesdeDatosAutogestionadoSQLserverExpressPaaS/Hora","IT-NPU-PA-BD-01-5","PaaS","PaaS Bases de Datos","PaaS Bases de Datos","Autogestionado","SQL server Express","PaaS/Hora",null,"NO","USD",null,null,0.09,7.0423999999999998,40.479999999999997,6.98,12.9621,26.288699999999999,10.095688596491231,10.957100000000001,8.3300999999999998,3.9878]
["PaaSPaaSBasesdeDatosPaaSBasesdeDatosGestionadoporelproveedorSQLserverExpressPaaS/Hora","IT-NPU-PA-BD-01-6","PaaS","PaaS Bases de Datos","PaaS Bases de Datos","Gestionado por el proveedor","SQL server Express","PaaS/Hora",null,"NO","USD",null,null,0.09,7.5575999999999999,60.48,96.98,14.2583,26.842199999999998,11.53508253588517,12.0528,7.5553999999999997,5.9817]
["PaaSPaaSBasesdeDatosPaaSBasesdeDatosAutogestionadoMySQLEnterprisePaaS/Hora","IT-NPU-PA-BD-01-7","PaaS","PaaS Bases de Datos","PaaS Bases de Datos","Autogestionado","MySQL Enterprise","PaaS/Hora",null,"NO","USD",null,null,5.6,2.2955000000000001,422.49,6.34,10.716699999999999,2.4537,29.322506416726753,5.5857000000000001,7.7213000000000003,21.167000000000002]
["PaaSPaaSBasesdeDatosPaaSBasesdeDatosGestionadoporelproveedorMySQLEnterprisePaaS/Hora","IT-NPU-PA-BD-01-8","PaaS","PaaS Bases de Datos","PaaS Bases de Datos","Gestionado por el proveedor","MySQL Enterprise","PaaS/Hora",null,"NO","USD",null,null,5.6,2.4635000000000002,460.49,96.34,11.7883,2.5053000000000001,30.761900356120691,5.7285000000000004,7.8388999999999998,31.750599999999999]
["PaaSPaaSBasesdeDatosPaaSBasesdeDatosAutogestionadoMariaDBPaaS/Hora","IT-NPU-PA-BD-01-9","PaaS","PaaS Bases de Datos","PaaS Bases de Datos","Autogestionado","MariaDB","PaaS/Hora",null,"NO","USD",null,null,5.6,2.2955000000000001,422.49,3.14,6.3224,23.381499999999999,29.322506416726753,5.5857000000000001,6.5797999999999996,21.167000000000002]
["PaaSPaaSBasesdeDatosPaaSBasesdeDatosGestionadoporelproveedorMariaDBPaaS/Hora","IT-NPU-PA-BD-01-10","PaaS","PaaS Bases de Datos","PaaS Bases de Datos","Gestionado por el proveedor","MariaDB","PaaS/Hora",null,"NO","USD",null,null,5.6,2.4635000000000002,460.49,93.14,6.9546999999999999,23.873699999999999,30.761900356120691,6.1441999999999997,6.6974,31.750599999999999]
["PaaSPaaSBasesdeDatosPaaSBasesdeDatosAutogestionadoPostgreSQLPaaS/Hora","IT-NPU-PA-BD-01-11","PaaS","PaaS Bases de Datos","PaaS Bases de Datos","Autogestionado","PostgreSQL","PaaS/Hora",null,"NO","USD",null,null,5.84,2.2955000000000001,344.99,6.36,6.3224,2.4537,29.9807806777217,5.5857000000000001,6.5797999999999996,21.751000000000001]
["PaaSPaaSBasesdeDatosPaaSBasesdeDatosGestionadoporelproveedorPostgreSQLPaaS/Hora","IT-NPU-PA-BD-01-12","PaaS","PaaS Bases de Datos","PaaS Bases de Datos","Gestionado por el proveedor","PostgreSQL","PaaS/Hora",null,"NO","USD",null,null,5.84,2.4635000000000002,422.99,96.36,6.9546999999999999,2.5053000000000001,31.420174617115642,6.1441999999999997,6.6974,32.6265]
["PaaSPaaSBasesdeDatosPaaSBasesdeDatosAutogestionadoSQLServerstandardPaaS/Mes","IT-NPU-PA-BD-01-13","PaaS","PaaS Bases de Datos","PaaS Bases de Datos","Autogestionado","SQL Server standard","PaaS/Mes",null,"NO","USD",null,null,8842.56,9338.532799999999,20182,16626.88,18823.849999999999,19558.762900000002,1576.3728505263159,9108.6857,11472.6994,39336.493499999997]
["PaaSPaaSBasesdeDatosPaaSBasesdeDatosGestionadoporelproveedorSQLServerstandardPaaS/Mes","IT-NPU-PA-BD-01-14","PaaS","PaaS Bases de Datos","PaaS Bases de Datos","Gestionado por el proveedor","SQL Server standard","PaaS/Mes",null,"NO","USD",null,null,8842.56,10021.84,20382,16986.88,20706.235000000001,19970.526399999999,1648.3425474960129,10019.5542,10329.481599999999,59004.7402]
["PaaSPaaSBasesdeDatosPaaSBasesdeDatosAutogestionadoSQLserverEnterprisePaaS/Mes","IT-NPU-PA-BD-01-15","PaaS","PaaS Bases de Datos","PaaS Bases de Datos","Autogestionado","SQL server Enterprise","PaaS/Mes",null,"NO","USD",null,null,27354.84,21748.532800000001,32173,33060.639999999999,35257.61,19558.762900000002,3254.8215031578952,32959.199999999997,27589.230599999999,69994.389200000005]
["PaaSPaaSBasesdeDatosPaaSBasesdeDatosGestionadoporelproveedorSQLserverEnterprisePaaS/Mes","IT-NPU-PA-BD-01-16","PaaS","PaaS Bases de Datos","PaaS Bases de Datos","Gestionado por el proveedor","SQL server Enterprise","PaaS/Mes",null,"NO","USD",null,null,27354.84,23339.888800000001,32373,33420.639999999999,38783.370999999999,19970.526399999999,3326.7912001275922,36255.120000000003,24719.241600000001,104991.58379999999]
["PaaSPaaSBasesdeDatosPaaSBasesdeDatosAutogestionadoSQLserverExpressPaaS/Mes","IT-NPU-PA-BD-01-17","PaaS","PaaS Bases de Datos","PaaS Bases de Datos","Autogestionado","SQL server Express","PaaS/Mes",null,"NO","USD",null,null,64.42,5140.8850000000002,3426,5098.72,9462.33,19558.762900000002,50.478442982456151,8152.1142,6080.9871000000003,2871.1972999999998]
["PaaSPaaSBasesdeDatosPaaSBasesdeDatosGestionadoporelproveedorSQLserverExpressPaaS/Mes","IT-NPU-PA-BD-01-18","PaaS","PaaS Bases de Datos","PaaS Bases de Datos","Gestionado por el proveedor","SQL server Express","PaaS/Mes",null,"NO","USD",null,null,64.42,5517.0474000000004,3626,5458.72,10408.563,19970.526399999999,64.872382376395549,8967.3256999999994,5515.4528,4306.7960000000003]
["PaaSPaaSBasesdeDatosPaaSBasesdeDatosAutogestionadoMySQLEnterprisePaaS/Mes","IT-NPU-PA-BD-01-19","PaaS","PaaS Bases de Datos","PaaS Bases de Datos","Autogestionado","MySQL Enterprise","PaaS/Mes",null,"NO","USD",null,null,4099.2,9098.4979999999996,9008.82,4634.7700000000004,7823.1750000000002,1825.4846,505.42968421052637,4155.7713999999996,5636.5661,15240.266799999999]
["PaaSPaaSBasesdeDatosPaaSBasesdeDatosGestionadoporelproveedorMySQLEnterprisePaaS/Mes","IT-NPU-PA-BD-01-20","PaaS","PaaS Bases de Datos","PaaS Bases de Datos","Gestionado por el proveedor","MySQL Enterprise","PaaS/Mes",null,"NO","USD",null,null,4099.2,9764.2416999999987,9208.82,4994.7700000000004,8605.4925000000003,1863.9158,577.39938118022337,4571.3485000000001,5722.5661,22860.4002]
["PaaSPaaSBasesdeDatosPaaSBasesdeDatosAutogestionadoMariaDBPaaS/Mes","IT-NPU-PA-BD-01-21","PaaS","PaaS Bases de Datos","PaaS Bases de Datos","Autogestionado","MariaDB","PaaS/Mes",null,"NO","USD",null,null,4099.2,9098.4979999999996,9008.82,2295.52,4615.37,17395.793900000001,505.42968421052637,4155.7713999999996,4803.2327999999998,15240.266799999999]
["PaaSPaaSBasesdeDatosPaaSBasesdeDatosGestionadoporelproveedorMariaDBPaaS/Mes","IT-NPU-PA-BD-01-22","PaaS","PaaS Bases de Datos","PaaS Bases de Datos","Gestionado por el proveedor","MariaDB","PaaS/Mes",null,"NO","USD",null,null,4099.2,9764.2416999999987,9208.82,2655.52,5076.9070000000002,17762.021100000002,577.39938118022337,4571.3485000000001,4889.2327999999998,22860.4002]
["PaaSPaaSBasesdeDatosPaaSBasesdeDatosAutogestionadoPostgreSQLPaaS/Mes","IT-NPU-PA-BD-01-23","PaaS","PaaS Bases de Datos","PaaS Bases de Datos","Autogestionado","PostgreSQL","PaaS/Mes",null,"NO","USD",null,null,4277.8100000000004,9098.4979999999996,7110.11,4642.9399999999996,4615.37,1825.4846,510.96989473684215,4155.7713999999996,4803.2327999999998,15660.7147]
["PaaSPaaSBasesdeDatosPaaSBasesdeDatosGestionadoporelproveedorPostgreSQLPaaS/Mes","IT-NPU-PA-BD-01-24","PaaS","PaaS Bases de Datos","PaaS Bases de Datos","Gestionado por el proveedor","PostgreSQL","PaaS/Mes",null,"NO","USD",null,null,4277.8100000000004,9764.2416999999987,7220.11,5002.9399999999996,5076.9070000000002,1863.9158,582.93959170653909,4571.3485000000001,4889.2327999999998,23491.072100000001]
["SaaSSaaSAPIGestióndeAPIAutogestionadoN/AAPI/Hora","IT-NPU-SA-AP-01-1","SaaS","SaaS API","Gestión de API","Autogestionado","N/A","API/Hora",null,"NO","USD",null,null,3.8,6.3600000000000004E-2,3.5,0.82,3.424658,3.3506,0.18037894736842108,1.1536,0.23519999999999999,8.5921000000000003]
["SaaSSaaSAPIGestióndeAPIGestionadoporelproveedorN/AAPI/Hora","IT-NPU-SA-AP-01-2","SaaS","SaaS API","Gestión de API","Gestionado por el proveedor","N/A","API/Hora",null,"NO","USD",null,null,3.8,6.83E-2,3.9,90.82,3.7671000000000001,3.4211,0.36030318979266351,1.2689999999999999,0.23519999999999999,12.888199999999999]
["PaaSPaaSMultimediaStreamingAutogestionadoN/APaaS/Hora","IT-NPU-PA-MU-02-1","PaaS","PaaS Multimedia","Streaming","Autogestionado","N/A","PaaS/Hora",null,"NO","USD",null,null,0.02,0.21629999999999999,0.32,0.2,9.6839999999999993,3.1547000000000001,57.71052631578948,0.1053,1E-4,1.3277000000000001]
["PaaSPaaSMultimediaStreamingGestionadoporelproveedorN/APaaS/Hora","IT-NPU-PA-MU-02-2","PaaS","PaaS Multimedia","Streaming","Gestionado por el proveedor","N/A","PaaS/Hora",null,"NO","USD",null,null,0.02,0.23219999999999999,1.32,90.2,10.6525,3.2210999999999999,582.93959170653909,0.1158,1E-4,1.9915]
["PaaSPaaSMultimediaStreamingAutogestionadoN/APaaS/Mes","IT-NPU-PA-MU-02-3","PaaS","PaaS Multimedia","Streaming","Autogestionado","N/A","PaaS/Mes",null,"NO","USD",null,null,14.27,157.9545,236.95,150,7069.3532999999998,2347.0515999999998,57.71052631578948,78.328599999999994,9.74E-2,955.91229999999996]
["PaaSPaaSMultimediaStreamingGestionadoporelproveedorN/APaaS/Mes","IT-NPU-PA-MU-02-4","PaaS","PaaS Multimedia","Streaming","Gestionado por el proveedor","N/A","PaaS/Mes",null,"NO","USD",null,null,14.27,169.5121,296,510,7776.2887000000001,2396.4632000000001,72.104465709728871,86.1614,9.74E-2,1433.8685]
["PaaSPaaSServidoresdeAplicacionesServidordeAplicacionesAutogestionadoGlassfishEnterpriseserverPaaS/Hora","IT-NPU-PA-SA-01-1","PaaS","PaaS Servidores de Aplicaciones","Servidor de Aplicaciones","Autogestionado","Glassfish Enterprise server","PaaS/Hora",null,"NO","USD",null,null,0.38,12.463699999999999,2.31,6.98,5.7625000000000002,0.67020000000000002,568.83298509639872,0.7974,7.2760999999999996,17.844799999999999]
["PaaSPaaSServidoresdeAplicacionesServidordeAplicacionesGestionadoporelproveedorGlassfishEnterpriseserverPaaS/Hora","IT-NPU-PA-SA-01-2","PaaS","PaaS Servidores de Aplicaciones","Servidor de Aplicaciones","Gestionado por el proveedor","Glassfish Enterprise server","PaaS/Hora",null,"NO","USD",null,null,0.38,13.3757,2.5099999999999998,96.98,6.3388,0.68430000000000002,640.80268206609571,0.87719999999999998,7.4131,26.767099999999999]
["PaaSPaaSServidoresdeAplicacionesServidordeAplicacionesAutogestionadoJbossAS/WildFlyPaaS/Hora","IT-NPU-PA-SA-01-3","PaaS","PaaS Servidores de Aplicaciones","Servidor de Aplicaciones","Autogestionado","Jboss AS / WildFly","PaaS/Hora",null,"NO","USD",null,null,0.38,19.935700000000001,2.31,6.98,5.7625000000000002,0.67020000000000002,11.735139404418527,2.3815,6.6939000000000002,12.716100000000001]
["PaaSPaaSServidoresdeAplicacionesServidordeAplicacionesGestionadoporelproveedorJbossAS/WildFlyPaaS/Hora","IT-NPU-PA-SA-01-4","PaaS","PaaS Servidores de Aplicaciones","Servidor de Aplicaciones","Gestionado por el proveedor","Jboss AS / WildFly","PaaS/Hora",null,"NO","USD",null,null,0.38,21.394400000000001,2.5099999999999998,96.98,6.3388,0.68430000000000002,13.174533343812467,2.6196999999999999,6.7624000000000004,19.074100000000001]
["PaaSPaaSServidoresdeAplicacionesServidordeAplicacionesAutogestionadoJbosswebserverPaaS/Hora","IT-NPU-PA-SA-01-5","PaaS","PaaS Servidores de Aplicaciones","Servidor de Aplicaciones","Autogestionado","Jboss web server","PaaS/Hora",null,"NO","USD",null,null,0.38,19.935700000000001,2.31,6.98,5.7625000000000002,0.67020000000000002,170.94618298023076,0.46139999999999998,6.7510000000000003,13.8195]
["PaaSPaaSServidoresdeAplicacionesServidordeAplicacionesGestionadoporelproveedorJbosswebserverPaaS/Hora","IT-NPU-PA-SA-01-6","PaaS","PaaS Servidores de Aplicaciones","Servidor de Aplicaciones","Gestionado por el proveedor","Jboss web server","PaaS/Hora",null,"NO","USD",null,null,0.38,21.394400000000001,2.5099999999999998,96.98,6.3388,0.68430000000000002,185.34012237417016,0.50760000000000005,6.8194999999999997,20.729299999999999]
["PaaSPaaSServidoresdeAplicacionesServidordeAplicacionesAutogestionadoJbossEAPPaaS/Hora","IT-NPU-PA-SA-01-7","PaaS","PaaS Servidores de Aplicaciones","Servidor de Aplicaciones","Autogestionado","Jboss EAP","PaaS/Hora",null,"NO","USD",null,null,0.38,19.935700000000001,2.31,6.98,5.7625000000000002,0.67020000000000002,909.56728218611931,2.3815,8.3922000000000008,14.3508]
["PaaSPaaSServidoresdeAplicacionesServidordeAplicacionesGestionadoporelproveedorJbossEAPPaaS/Hora","IT-NPU-PA-SA-01-8","PaaS","PaaS Servidores de Aplicaciones","Servidor de Aplicaciones","Gestionado por el proveedor","Jboss EAP","PaaS/Hora",null,"NO","USD",null,null,0.38,21.394400000000001,2.5099999999999998,96.98,6.3388,0.68430000000000002,981.53697915581631,2.6196999999999999,7.6791,21.526199999999999]
["PaaSPaaSServidoresdeAplicacionesServidordeAplicacionesAutogestionadoInternetInformationServicesPaaS/Hora","IT-NPU-PA-SA-01-9","PaaS","PaaS Servidores de Aplicaciones","Servidor de Aplicaciones","Autogestionado","Internet Information Services","PaaS/Hora",null,"NO","USD",null,null,0.38,12.463699999999999,4.47,6.98,9.5168999999999997,0.70109999999999995,0.35789473684210532,0.97140000000000004,11.088900000000001,17.844799999999999]
["PaaSPaaSServidoresdeAplicacionesServidordeAplicacionesGestionadoporelproveedorInternetInformationServicesPaaS/Hora","IT-NPU-PA-SA-01-10","PaaS","PaaS Servidores de Aplicaciones","Servidor de Aplicaciones","Gestionado por el proveedor","Internet Information Services","PaaS/Hora",null,"NO","USD",null,null,0.38,13.3757,5.47,96.98,10.4686,0.71579999999999999,0.5378189792663477,1.0686,11.2065,26.767099999999999]
["PaaSPaaSServidoresdeAplicacionesServidordeAplicacionesAutogestionadoGlassfishEnterpriseserverPaaS/Mes","IT-NPU-PA-SA-01-11","PaaS","PaaS Servidores de Aplicaciones","Servidor de Aplicaciones","Autogestionado","Glassfish Enterprise server","PaaS/Mes",null,"NO","USD",null,null,278.16000000000003,9098.4979999999996,1683.53,5098.72,4206.6532999999999,498.55680000000001,829.73824825429347,593.29999999999995,5311.5661,12848.226199999999]
["PaaSPaaSServidoresdeAplicacionesServidordeAplicacionesGestionadoporelproveedorGlassfishEnterpriseserverPaaS/Mes","IT-NPU-PA-SA-01-12","PaaS","PaaS Servidores de Aplicaciones","Servidor de Aplicaciones","Gestionado por el proveedor","Glassfish Enterprise server","PaaS/Mes",null,"NO","USD",null,null,278.16000000000003,9764.2416999999987,1883.53,5458.72,4627.3186999999998,509.05270000000002,901.70794522399046,652.63,5411.5661,19272.339199999999]
["PaaSPaaSServidoresdeAplicacionesServidordeAplicacionesAutogestionadoJbossAS/WildFlyPaaS/Mes","IT-NPU-PA-SA-01-13","PaaS","PaaS Servidores de Aplicaciones","Servidor de Aplicaciones","Autogestionado","Jboss AS / WildFly","PaaS/Mes",null,"NO","USD",null,null,278.16000000000003,14553.043399999999,1683.53,5098.72,4206.6532999999999,498.55680000000001,272.64040256231328,1771.8714,4886.5661,9155.5651999999991]
[{"$f":"SUBSTITUTE(C131&D131&E131&F131&G131&H131,\" \",\"\")","v":"PaaSPaaSServidoresdeAplicacionesServidordeAplicacionesGestionadoporelproveedorJbossAS/WildFlyPaaS/Mes"},"IT-NPU-PA-SA-01-14","PaaS","PaaS Servidores de Aplicaciones","Servidor de Aplicaciones","Gestionado por el proveedor","Jboss AS / WildFly","PaaS/Mes",null,"NO","USD",null,null,278.16000000000003,15617.9002,1883.53,5458.72,4627.3186999999998,509.05270000000002,344.61009953201028,1949.0586000000001,4936.5661,13733.3478]
["PaaSPaaSServidoresdeAplicacionesServidordeAplicacionesAutogestionadoJbosswebserverPaaS/Mes","IT-NPU-PA-SA-01-15","PaaS","PaaS Servidores de Aplicaciones","Servidor de Aplicaciones","Autogestionado","Jboss web server","PaaS/Mes",null,"NO","USD",null,null,278.16000000000003,14553.043399999999,1683.53,5098.72,4206.6532999999999,498.55680000000001,431.85144613812554,343.3,4928.2327999999998,9950.0401999999995]
["PaaSPaaSServidoresdeAplicacionesServidordeAplicacionesGestionadoporelproveedorJbosswebserverPaaS/Mes","IT-NPU-PA-SA-01-16","PaaS","PaaS Servidores de Aplicaciones","Servidor de Aplicaciones","Gestionado por el proveedor","Jboss web server","PaaS/Mes",null,"NO","USD",null,null,278.16000000000003,15617.9002,1883.53,5458.72,4627.3186999999998,509.05270000000002,503.82114310782254,377.63,4978.2327999999998,14925.060299999999]
["PaaSPaaSServidoresdeAplicacionesServidordeAplicacionesAutogestionadoJbossEAPPaaS/Mes","IT-NPU-PA-SA-01-17","PaaS","PaaS Servidores de Aplicaciones","Servidor de Aplicaciones","Autogestionado","Jboss EAP","PaaS/Mes",null,"NO","USD",null,null,278.16000000000003,14553.043399999999,1683.53,5098.72,4206.6532999999999,498.55680000000001,1170.4725453440142,1771.8714,6126.2874000000002,10332.565199999999]
["PaaSPaaSServidoresdeAplicacionesServidordeAplicacionesGestionadoporelproveedorJbossEAPPaaS/Mes","IT-NPU-PA-SA-01-18","PaaS","PaaS Servidores de Aplicaciones","Servidor de Aplicaciones","Gestionado por el proveedor","Jboss EAP","PaaS/Mes",null,"NO","USD",null,null,278.16000000000003,15617.9002,1883.53,5458.72,4627.3186999999998,509.05270000000002,1242.4422423137112,1949.0586000000001,6176.2874000000002,15498.8478]
["PaaSPaaSServidoresdeAplicacionesServidordeAplicacionesAutogestionadoInternetInformationServicesPaaS/Mes","IT-NPU-PA-SA-01-19","PaaS","PaaS Servidores de Aplicaciones","Servidor de Aplicaciones","Autogestionado","Internet Information Services","PaaS/Mes",null,"NO","USD",null,null,278.16000000000003,9098.4979999999996,3323.5,5098.72,6947.3532999999998,521.56709999999998,261.26315789473688,722.74289999999996,8094.8904000000002,12848.226199999999]
["PaaSPaaSServidoresdeAplicacionesServidordeAplicacionesGestionadoporelproveedorInternetInformationServicesPaaS/Mes","IT-NPU-PA-SA-01-20","PaaS","PaaS Servidores de Aplicaciones","Servidor de Aplicaciones","Gestionado por el proveedor","Internet Information Services","PaaS/Mes",null,"NO","USD",null,null,278.16000000000003,9764.2416999999987,3763.5,5458.72,7642.0887000000002,532.54740000000004,275.65709728867625,795.01710000000003,8180.8904000000002,19272.339199999999]
["PaaSPaaSServidoresdeAplicacionesDes,prueydespldeAppMóvilAutogestionadoN/APaaS/Hora","IT-NPU-PA-SA-02-1","PaaS","PaaS Servidores de Aplicaciones","Des, prue y despl de App Móvil","Autogestionado","N/A","PaaS/Hora",null,"NO","USD",null,null,0.6,5.4982999999999995,0.41599999999999998,25,3.1086999999999998,0.70109999999999995,6.7105263157894737E-2,0.42499999999999999,3.0733999999999999,107.67019999999999]
["PaaSPaaSServidoresdeAplicacionesDes,prueydespldeAppMóvilGestionadoporelproveedorN/APaaS/Hora","IT-NPU-PA-SA-02-2","PaaS","PaaS Servidores de Aplicaciones","Des, prue y despl de App Móvil","Gestionado por el proveedor","N/A","PaaS/Hora",null,"NO","USD",null,null,0.6,5.9005999999999998,0.69,115,3.4196,0.71579999999999999,0.24702950558213715,0.46750000000000003,3.4422000000000001,161.50540000000001]
["PaaSPaaSServidoresdeAplicacionesDes,prueydespldeAppMóvilAutogestionadoN/APaaS/Mes","IT-NPU-PA-SA-02-3","PaaS","PaaS Servidores de Aplicaciones","Des, prue y despl de App Móvil","Autogestionado","N/A","PaaS/Mes",null,"NO","USD",null,null,438.95,4013.7167000000004,300,25,2269.37,521.56709999999998,48.986842105263165,316.20000000000005,2243.5616,77522.575400000002]
["PaaSPaaSServidoresdeAplicacionesDes,prueydespldeAppMóvilGestionadoporelproveedorN/APaaS/Mes","IT-NPU-PA-SA-02-4","PaaS","PaaS Servidores de Aplicaciones","Des, prue y despl de App Móvil","Gestionado por el proveedor","N/A","PaaS/Mes",null,"NO","USD",null,null,438.95,4307.4032000000007,375,115,2496.3069999999998,532.54740000000004,50.426236044657102,347.82,2243.5616,116283.863]
["PaaSPaaSServidoresdeAplicacionesDes,prueydespldeAppWebAutogestionadoN/APaaS/Hora","IT-NPU-PA-SA-03-1","PaaS","PaaS Servidores de Aplicaciones","Des, prue y despl de App Web","Autogestionado","N/A","PaaS/Hora",null,"NO","USD",null,null,0.45,1.5351999999999999,0.42,0.4,2.9441000000000002,0.70109999999999995,6.7105263157894737E-2,0.42499999999999999,3.0733999999999999,107.67019999999999]
["PaaSPaaSServidoresdeAplicacionesDes,prueydespldeAppWebGestionadoporelproveedorN/APaaS/Hora","IT-NPU-PA-SA-03-2","PaaS","PaaS Servidores de Aplicaciones","Des, prue y despl de App Web","Gestionado por el proveedor","N/A","PaaS/Hora",null,"NO","USD",null,null,0.45,1.6475,0.52500000000000002,90.4,3.2385000000000002,0.71579999999999999,0.24702950558213715,0.46750000000000003,3.4422000000000001,161.50540000000001]
["PaaSPaaSServidoresdeAplicacionesDes,prueydespldeAppWebAutogestionadoN/APaaS/Mes","IT-NPU-PA-SA-03-3","PaaS","PaaS Servidores de Aplicaciones","Des, prue y despl de App Web","Autogestionado","N/A","PaaS/Mes",null,"NO","USD",null,null,326.49,1120.6547,300,273.98,2149.1799999999998,521.56709999999998,48.986842105263165,316.20000000000005,2243.5616,77522.575400000002]
["PaaSPaaSServidoresdeAplicacionesDes,prueydespldeAppWebGestionadoporelproveedorN/APaaS/Mes","IT-NPU-PA-SA-03-4","PaaS","PaaS Servidores de Aplicaciones","Des, prue y despl de App Web","Gestionado por el proveedor","N/A","PaaS/Mes",null,"NO","USD",null,null,326.49,1202.6539,375,633.98,2364.098,532.54740000000004,63.380781499202556,347.82,2243.5616,116283.863]
["PaaSPaaSServidoresdeAplicacionesServidoresWebAutogestionadoApachePaaS/Hora","IT-NPU-PA-SA-04-1","PaaS","PaaS Servidores de Aplicaciones","Servidores Web","Autogestionado","Apache","PaaS/Hora",null,"NO","USD",null,null,0.91,12.463699999999999,2.31,3.87,5.6768999999999998,0.70109999999999995,0.34,0.92279999999999995,6.5797999999999996,12.560499999999999]
["PaaSPaaSServidoresdeAplicacionesServidoresWebGestionadoporelproveedorApachePaaS/Hora","IT-NPU-PA-SA-04-2","PaaS","PaaS Servidores de Aplicaciones","Servidores Web","Gestionado por el proveedor","Apache","PaaS/Hora",null,"NO","USD",null,null,0.91,13.3757,2.88,93.87,6.2446000000000002,0.71579999999999999,0.69984848484848494,1.0150999999999999,6.6974,18.840800000000002]
["PaaSPaaSServidoresdeAplicacionesServidoresWebAutogestionadoIIS(InternetInformationsserver)PaaS/Hora","IT-NPU-PA-SA-04-3","PaaS","PaaS Servidores de Aplicaciones","Servidores Web","Autogestionado","IIS ( Internet Informations server)","PaaS/Hora",null,"NO","USD",null,null,1.1000000000000001,12.463699999999999,4.47,6.98,9.5168999999999997,0.70109999999999995,0.35789473684210532,0.97140000000000004,11.088900000000001,17.844799999999999]
["PaaSPaaSServidoresdeAplicacionesServidoresWebGestionadoporelproveedorIIS(InternetInformationsserver)PaaS/Hora","IT-NPU-PA-SA-04-4","PaaS","PaaS Servidores de Aplicaciones","Servidores Web","Gestionado por el proveedor","IIS ( Internet Informations server)","PaaS/Hora",null,"NO","USD",null,null,1.1000000000000001,13.3757,5.58,96.98,10.4686,0.71579999999999999,0.71774322169059013,1.0686,11.2065,26.767099999999999]
["PaaSPaaSServidoresdeAplicacionesServidoresWebAutogestionadoTomcatPaaS/Hora","IT-NPU-PA-SA-04-5","PaaS","PaaS Servidores de Aplicaciones","Servidores Web","Autogestionado","Tomcat","PaaS/Hora",null,"NO","USD",null,null,0.91,12.463699999999999,2.31,3.87,5.6768999999999998,0.70109999999999995,0.34,0.92279999999999995,6.5797999999999996,12.560499999999999]
["PaaSPaaSServidoresdeAplicacionesServidoresWebGestionadoporelproveedorTomcatPaaS/Hora","IT-NPU-PA-SA-04-6","PaaS","PaaS Servidores de Aplicaciones","Servidores Web","Gestionado por el proveedor","Tomcat","PaaS/Hora",null,"NO","USD",null,null,0.91,13.3757,2.88,93.87,6.2446000000000002,0.71579999999999999,0.69984848484848494,1.0150999999999999,6.6974,18.840800000000002]
["PaaSPaaSServidoresdeAplicacionesServidoresWebAutogestionadoApachePaaS/Mes","IT-NPU-PA-SA-04-7","PaaS","PaaS Servidores de Aplicaciones","Servidores Web","Autogestionado","Apache","PaaS/Mes",null,"NO","USD",null,null,669.43,9098.4979999999996,1683.53,2828,4144.1532999999999,521.56709999999998,248.20000000000005,686.6,4803.2327999999998,9043.5619000000006]
["PaaSPaaSServidoresdeAplicacionesServidoresWebGestionadoporelproveedorApachePaaS/Mes","IT-NPU-PA-SA-04-8","PaaS","PaaS Servidores de Aplicaciones","Servidores Web","Gestionado por el proveedor","Apache","PaaS/Mes",null,"NO","USD",null,null,669.43,9764.2416999999987,1883.53,3188,4558.5686999999998,532.54740000000004,320.16969696969704,755.26,4889.2327999999998,13565.3428]
["PaaSPaaSServidoresdeAplicacionesServidoresWebAutogestionadoIIS(InternetInformationsserver)PaaS/Mes","IT-NPU-PA-SA-04-9","PaaS","PaaS Servidores de Aplicaciones","Servidores Web","Autogestionado","IIS (Internet Informations server)","PaaS/Mes",null,"NO","USD",null,null,804.13,9098.4979999999996,3323.5,5098.72,6947.3532999999998,521.56709999999998,261.26315789473688,722.74289999999996,8094.8904000000002,12848.226199999999]
["PaaSPaaSServidoresdeAplicacionesServidoresWebGestionadoporelproveedorIIS(InternetInformationsserver)PaaS/Mes","IT-NPU-PA-SA-04-10","PaaS","PaaS Servidores de Aplicaciones","Servidores Web","Gestionado por el proveedor","IIS (Internet Informations server)","PaaS/Mes",null,"NO","USD",null,null,804.13,9764.2416999999987,3763.5,5458.72,7642.0887000000002,532.54740000000004,333.23285486443388,795.01710000000003,8180.8904000000002,19272.339199999999]
["PaaSPaaSServidoresdeAplicacionesServidoresWebAutogestionadoTomcatPaaS/Mes","IT-NPU-PA-SA-04-11","PaaS","PaaS Servidores de Aplicaciones","Servidores Web","Autogestionado","Tomcat","PaaS/Mes",null,"NO","USD",null,null,669.43,9098.4979999999996,1683.53,2828,4144.1532999999999,521.56709999999998,248.20000000000005,686.6,4803.2327999999998,9043.5619000000006]
["PaaSPaaSServidoresdeAplicacionesServidoresWebGestionadoporelproveedorTomcatPaaS/Mes","IT-NPU-PA-SA-04-12","PaaS","PaaS Servidores de Aplicaciones","Servidores Web","Gestionado por el proveedor","Tomcat","PaaS/Mes",null,"NO","USD",null,null,669.43,9764.2416999999987,1883.53,3188,4558.5686999999998,532.54740000000004,320.16969696969704,755.26,4889.2327999999998,13565.3428]
["PaaSPaaSSeguridadApplianceseguridadvirtualautoescalableAutogestionadoN/APaaS/Hora","IT-NPU-PA-SE-01-1","PaaS","PaaS Seguridad","Appliance seguridad virtual autoescalable","Autogestionado","N/A","PaaS/Hora",null,"NO","USD",null,null,0.03,16.511600000000001,4.26,2.4300000000000002,3.7902,2.4691000000000001,214.73684210526318,0.51,4.7939999999999996,3.9971000000000001]
["PaaSPaaSSeguridadApplianceseguridadvirtualautoescalableGestionadoporelproveedorN/APaaS/Hora","IT-NPU-PA-SE-01-2","PaaS","PaaS Seguridad","Appliance seguridad virtual autoescalable","Gestionado por el proveedor","N/A","PaaS/Hora",null,"NO","USD",null,null,0.03,17.7197,4.3600000000000003,92.43,4.1692,2.5211000000000001,286.70653907496012,0.51,4.7939999999999996,5.9955999999999996]
["PaaSPaaSSeguridadApplianceseguridadvirtualautoescalableAutogestionadoN/APaaS/Mes","IT-NPU-PA-SE-01-3","PaaS","PaaS Seguridad","Appliance seguridad virtual autoescalable","Autogestionado","N/A","PaaS/Mes",null,"NO","USD",null,null,21.96,12053.409099999999,3000,1772.07,2766.8141999999998,1836.9897000000001,214.73684210526318,382.11,3499.6025,2973.8364000000001]
["PaaSPaaSSeguridadApplianceseguridadvirtualautoescalableGestionadoporelproveedorN/APaaS/Mes","IT-NPU-PA-SE-01-4","PaaS","PaaS Seguridad","Appliance seguridad virtual autoescalable","Gestionado por el proveedor","N/A","PaaS/Mes",null,"NO","USD",null,null,21.96,12935.365899999999,3700,2132.0699999999997,3043.4956000000002,1875.6632,286.70653907496012,382.11,3499.6025,4460.7547000000004]
["PaaSPaaSSeguridadWAFautoescalableAutogestionadoN/APaaS/Hora","IT-NPU-PA-SE-02-1","PaaS","PaaS Seguridad","WAF autoescalable","Autogestionado","N/A","PaaS/Hora",null,"NO","USD",null,null,0.02,16.325600000000001,7.0000000000000007E-2,0.27,0.18720000000000001,4.0979999999999999,292.61473684210534,0.62,4.6855000000000002,3.9971000000000001]
["PaaSPaaSSeguridadWAFautoescalableGestionadoporelproveedorN/APaaS/Hora","IT-NPU-PA-SE-02-2","PaaS","PaaS Seguridad","WAF autoescalable","Gestionado por el proveedor","N/A","PaaS/Hora",null,"NO","USD",null,null,0.02,17.520199999999999,1.07,90.27,0.2059,4.1843000000000004,364.58443381180234,0.62,4.6855000000000002,5.9955999999999996]
["PaaSPaaSSeguridadWAFautoescalableAutogestionadoN/APaaS/Mes","IT-NPU-PA-SE-02-3","PaaS","PaaS Seguridad","WAF autoescalable","Autogestionado","N/A","PaaS/Mes",null,"NO","USD",null,null,14,11917.6847,55,200,1084.3742,3048.866,292.61473684210534,463.05,3420.4349000000002,2973.8364000000001]
["PaaSPaaSSeguridadWAFautoescalableGestionadoporelproveedorN/APaaS/Mes","IT-NPU-PA-SE-02-4","PaaS","PaaS Seguridad","WAF autoescalable","Gestionado por el proveedor","N/A","PaaS/Mes",null,"NO","USD",null,null,14,12789.7104,65,560,1192.8116,3113.0527000000002,364.58443381180234,463.05,3420.4349000000002,4460.7547000000004]
["PaaSPaaSSeguridadDirectoriodeIdentidadesAutogestionadoN/AUsuario/Hora","IT-NPU-PA-SE-03-1","PaaS","PaaS Seguridad","Directorio de Identidades","Autogestionado","N/A","Usuario/Hora",null,"NO","USD",null,null,0.23,19.190899999999999,1,5,410.95890000000003,0.17649999999999999,0.89473684210526316,1.9429000000000001,9.0515000000000008,0.74270000000000003]
["PaaSPaaSSeguridadDirectoriodeIdentidadesGestionadoporelproveedorN/AUsuario/Hora","IT-NPU-PA-SE-03-2","PaaS","PaaS Seguridad","Directorio de Identidades","Gestionado por el proveedor","N/A","Usuario/Hora",null,"NO","USD",null,null,0.23,20.595099999999999,20,95,452.0548,0.18079999999999999,1.2545853269537481,2.1371000000000002,9.0515000000000008,1.1140000000000001]
["PaaSPaaSSeguridadDirectoriodeIdentidadesAutogestionadoN/AUsuario/Mes","IT-NPU-PA-SE-03-3","PaaS","PaaS Seguridad","Directorio de Identidades","Autogestionado","N/A","Usuario/Mes",null,"NO","USD",null,null,164.8,14009.3277,1,5,300000,131.29419999999999,0.89473684210526316,279.77140000000003,6607.5599000000002,552.55909999999994]
["PaaSPaaSSeguridadDirectoriodeIdentidadesGestionadoporelproveedorN/AUsuario/Mes","IT-NPU-PA-SE-03-4","PaaS","PaaS Seguridad","Directorio de Identidades","Gestionado por el proveedor","N/A","Usuario/Mes",null,"NO","USD",null,null,164.8,15034.4005,20,95,330000,134.4579,1.2545853269537481,307.74860000000001,6607.5599000000002,828.83870000000002]
["PaaSPaaSSeguridadEscanerdevulnerabilidadesautoescalableAutogestionadoN/APaaS/Hora","IT-NPU-PA-SE-04-1","PaaS","PaaS Seguridad","Escaner de vulnerabilidades autoescalable","Autogestionado","N/A","PaaS/Hora",null,"NO","USD",null,null,0.25,1.9900000000000001E-2,4.16,7.0000000000000007E-2,1.9076,45809.411800000002,161.05263157894737,0.38400000000000001,1.4348000000000001,0.35310000000000002]
["PaaSPaaSSeguridadEscanerdevulnerabilidadesautoescalableGestionadoporelproveedorN/APaaS/Hora","IT-NPU-PA-SE-04-2","PaaS","PaaS Seguridad","Escaner de vulnerabilidades autoescalable","Gestionado por el proveedor","N/A","PaaS/Hora",null,"NO","USD",null,null,0.25,2.1299999999999999E-2,5.1360000000000001,90.07,2.0983999999999998,45809.411800000002,175.44657097288678,0.42249999999999999,1.4348000000000001,0.52969999999999995]
["PaaSPaaSSeguridadEscanerdevulnerabilidadesautoescalableAutogestionadoN/APaaS/Mes","IT-NPU-PA-SE-04-3","PaaS","PaaS Seguridad","Escaner de vulnerabilidades autoescalable","Autogestionado","N/A","PaaS/Mes",null,"NO","USD",null,null,183,14.4887,3000,61.32,1392.5450000000001,45809.411800000002,161.05263157894737,285.71429999999998,1047.3800000000001,262.70639999999997]
["PaaSPaaSSeguridadEscanerdevulnerabilidadesautoescalableGestionadoporelproveedorN/APaaS/Mes","IT-NPU-PA-SE-04-4","PaaS","PaaS Seguridad","Escaner de vulnerabilidades autoescalable","Gestionado por el proveedor","N/A","PaaS/Mes",null,"NO","USD",null,null,183,15.5488,3700,421.32,1531.7995000000001,45809.411800000002,175.44657097288678,314.28570000000002,764587.4,394.05959999999999]
["PaaSPaaSSeguridadCertificadosSSLAutogestionadoN/ACertificado/Año","IT-NPU-PA-SE-05-1","PaaS","PaaS Seguridad","Certificados SSL","Autogestionado","N/A","Certificado/Año",null,"NO","USD",null,null,595,1692.0454999999999,26400,336,2770.8029999999999,262.87790000000001,2313.7254901960782,642.78570000000002,4750.8993,5296.5]
["PaaSPaaSSeguridadCertificadosSSLGestionadoporelproveedorN/ACertificado/Año","IT-NPU-PA-SE-05-2","PaaS","PaaS Seguridad","Certificados SSL","Gestionado por el proveedor","N/A","Certificado/Año",null,"NO","USD",null,null,595,1815.8536999999999,28400,516,3047.8833,268.41219999999998,2385.6951871657752,707.0643,4750.8993,7944.75]
["IaaSIaaSProcesamientoServidoresVirtualesdeAltaCapacidadAutogestionadoDebianServidorVirtual/Hora","IT-NPU-IA-PR-04","IaaS","IaaS Procesamiento","Servidores Virtuales de Alta Capacidad","Autogestionado","Debian","Servidor Virtual / Hora",null,"NO","USD",null,null,31.212,12.328767123287671,7.64088888888889,18.236752138508376,7.34,26.016091506849314,14.433698630136984,31,15.922570958904108,18.236752138508376]
["IaaSIaaSProcesamientoServidoresVirtualesdeAltaCapacidadAutogestionadoSUSELinuxEnterpriseServidorVirtual/Hora","IT-NPU-IA-PR-05","IaaS","IaaS Procesamiento","Servidores Virtuales de Alta Capacidad","Autogestionado","SUSE Linux Enterprise","Servidor Virtual / Hora",null,"NO","USD",null,null,31.361999999999998,12.328767123287671,7.8120000000000003,18.45564102739726,7.45,26.016091506849314,14.753698630136986,32,15.922570958904108,18.45564102739726]
["IaaSIaaSProcesamientoServidoresVirtualesdeAltaCapacidadAutogestionadoUbuntuServidorVirtual/Hora","IT-NPU-IA-PR-06","IaaS","IaaS Procesamiento","Servidores Virtuales de Alta Capacidad","Autogestionado","Ubuntu","Servidor Virtual / Hora",null,"NO","USD",null,null,31.212,12.328767123287671,7.64088888888889,18.236752138508376,7.34,26.016091506849314,14.433698630136984,31,15.922570958904108,18.236752138508376]
["IaaSIaaSProcesamientoServidoresVirtualesdeAltaCapacidadAutogestionadoRedHatEnterpriseServidorVirtual/Hora","IT-NPU-IA-PR-07","IaaS","IaaS Procesamiento","Servidores Virtuales de Alta Capacidad","Autogestionado","RedHat Enterprise","Servidor Virtual / Hora",null,"NO","USD",null,null,31.341999999999999,12.328767123287671,7.7886666666666668,18.277816484018263,7.47,26.016091506849314,14.208835616438355,31,16.068170958904108,18.277816484018263]
["IaaSIaaSProcesamientoServidoresVirtualesdeAltaCapacidadAutogestionadoWindowsServerServidorVirtual/Hora","IT-NPU-IA-PR-08","IaaS","IaaS Procesamiento","Servidores Virtuales de Alta Capacidad","Autogestionado","Windows Server","Servidor Virtual / Hora",null,"NO","USD",null,null,35.628,12.472602739726028,12.668444444444445,23.800228158295283,11.18,35.966811506849318,19.966835616438356,40,22.51913095890411,23.800228158295283]
["IaaSIaaSProcesamientoServidoresVirtualesdeAltaCapacidadAutogestionadoWindowsServerDatacenterServidorVirtual/Hora","IT-NPU-IA-PR-09","IaaS","IaaS Procesamiento","Servidores Virtuales de Alta Capacidad","Autogestionado","Windows Server Datacenter","Servidor Virtual / Hora",null,"NO","USD",null,null,35.628,12.472602739726028,12.668444444444445,23.800228158295283,11.18,35.966811506849318,19.966835616438356,40,22.51913095890411,23.800228158295283]
["IaaSIaaSProcesamientoServidoresVirtualesdeAltaCapacidadGestionadoporelproveedorDebianServidorVirtual/Hora","IT-NPU-IA-PR-10","IaaS","IaaS Procesamiento","Servidores Virtuales de Alta Capacidad","Gestionado por el proveedor","Debian","Servidor Virtual / Hora",null,"NO","USD",null,null,40.575600000000001,12.876712328767123,8.2498677333333337,20.913836661440637,8.0739999999999998,26.565031037643831,20.928863013698628,34,16.040619178082192,20.913836661440637]
["IaaSIaaSProcesamientoServidoresVirtualesdeAltaCapacidadGestionadoporelproveedorSUSELinuxEnterpriseServidorVirtual/Hora","IT-NPU-IA-PR-11","IaaS","IaaS Procesamiento","Servidores Virtuales de Alta Capacidad","Gestionado por el proveedor","SUSE Linux Enterprise","Servidor Virtual / Hora",null,"NO","USD",null,null,40.770600000000002,12.876712328767123,8.4346163999999995,21.159430244773972,8.1950000000000003,26.565031037643831,21.39286301369863,35,16.040619178082192,21.159430244773972]
["IaaSIaaSProcesamientoServidoresVirtualesdeAltaCapacidadGestionadoporelproveedorUbuntuServidorVirtual/Hora","IT-NPU-IA-PR-12","IaaS","IaaS Procesamiento","Servidores Virtuales de Alta Capacidad","Gestionado por el proveedor","Ubuntu","Servidor Virtual / Hora",null,"NO","USD",null,null,40.575600000000001,12.876712328767123,8.2498677333333337,20.913836661440637,8.0739999999999998,26.565031037643831,20.928863013698628,34,16.040619178082192,20.913836661440637]
["IaaSIaaSProcesamientoServidoresVirtualesdeAltaCapacidadGestionadoporelproveedorRedHatEnterpriseServidorVirtual/Hora","IT-NPU-IA-PR-13","IaaS","IaaS Procesamiento","Servidores Virtuales de Alta Capacidad","Gestionado por el proveedor","RedHat Enterprise","Servidor Virtual / Hora",null,"NO","USD",null,null,40.744599999999998,12.876712328767123,8.4094233999999997,20.950224698541096,8.2170000000000005,26.565031037643831,20.602811643835615,34,16.18621917808219,20.950224698541096]
["IaaSIaaSProcesamientoServidoresVirtualesdeAltaCapacidadGestionadoporelproveedorWindowsServerServidorVirtual/Hora","IT-NPU-IA-PR-14","IaaS","IaaS Procesamiento","Servidores Virtuales de Alta Capacidad","Gestionado por el proveedor","Windows Server","Servidor Virtual / Hora",null,"NO","USD",null,null,46.316400000000002,13.127397260273973,13.678119466666665,27.216869847312783,12.298,36.725711229643835,28.951911643835615,44,22.637419178082194,27.216869847312783]
["IaaSIaaSProcesamientoServidoresVirtualesdeAltaCapacidadGestionadoporelproveedorWindowsServerDatacenterServidorVirtual/Hora","IT-NPU-IA-PR-15","IaaS","IaaS Procesamiento","Servidores Virtuales de Alta Capacidad","Gestionado por el proveedor","Windows Server Datacenter","Servidor Virtual / Hora",null,"NO","USD",null,null,46.316400000000002,13.127397260273973,13.678119466666665,27.216869847312783,12.298,36.725711229643835,28.951911643835615,44,22.637419178082194,27.216869847312783]
["IaaSIaaSProcesamientoServidoresVirtualesdeAltaCapacidadAutogestionadoDebianServidorVirtual/Mes","IT-NPU-IA-PR-16","IaaS","IaaS Procesamiento","Servidores Virtuales de Alta Capacidad","Autogestionado","Debian","Servidor Virtual / Mes",null,"NO","USD",null,null,22847.184000000001,12.328767123287671,5501.4400000000005,11604.21944589041,5358.2,14609.036,10277.549999999999,22606,11622.016799999999,11604.21944589041]
["IaaSIaaSProcesamientoServidoresVirtualesdeAltaCapacidadAutogestionadoSUSELinuxEnterpriseServidorVirtual/Mes","IT-NPU-IA-PR-17","IaaS","IaaS Procesamiento","Servidores Virtuales de Alta Capacidad","Autogestionado","SUSE Linux Enterprise","Servidor Virtual / Mes",null,"NO","USD",null,null,22956.984,12.328767123287671,5624.64,11746.95694589041,5438.5,14609.036,10511.15,23201,11622.016799999999,11746.95694589041]
["IaaSIaaSProcesamientoServidoresVirtualesdeAltaCapacidadAutogestionadoUbuntuServidorVirtual/Mes","IT-NPU-IA-PR-18","IaaS","IaaS Procesamiento","Servidores Virtuales de Alta Capacidad","Autogestionado","Ubuntu","Servidor Virtual / Mes",null,"NO","USD",null,null,22847.184000000001,12.328767123287671,5501.4400000000005,11604.21944589041,5358.2,14609.036,10277.549999999999,22606,11622.016799999999,11604.21944589041]
["IaaSIaaSProcesamientoServidoresVirtualesdeAltaCapacidadAutogestionadoRedHatEnterpriseServidorVirtual/Mes","IT-NPU-IA-PR-19","IaaS","IaaS Procesamiento","Servidores Virtuales de Alta Capacidad","Autogestionado","RedHat Enterprise","Servidor Virtual / Mes",null,"NO","USD",null,null,22942.343999999997,12.328767123287671,5607.84,11692.050445890409,5453.0999999999995,14609.036,10372.449999999999,22811,11728.3048,11692.050445890409]
["IaaSIaaSProcesamientoServidoresVirtualesdeAltaCapacidadAutogestionadoWindowsServerServidorVirtual/Mes","IT-NPU-IA-PR-20","IaaS","IaaS Procesamiento","Servidores Virtuales de Alta Capacidad","Autogestionado","Windows Server","Servidor Virtual / Mes",null,"NO","USD",null,null,26079.696,12.472602739726028,9121.2800000000007,15521.679025342466,8161.4,20196.748,14575.789999999999,29590,16436.045600000001,15521.679025342466]
["IaaSIaaSProcesamientoServidoresVirtualesdeAltaCapacidadAutogestionadoWindowsServerDatacenterServidorVirtual/Mes","IT-NPU-IA-PR-21","IaaS","IaaS Procesamiento","Servidores Virtuales de Alta Capacidad","Autogestionado","Windows Server Datacenter","Servidor Virtual / Mes",null,"NO","USD",null,null,26079.696,12.472602739726028,9121.2800000000007,15521.679025342466,8161.4,20196.748,14575.789999999999,29590,16436.045600000001,15521.679025342466]
["IaaSIaaSProcesamientoServidoresVirtualesdeAltaCapacidadGestionadoporelproveedorDebianServidorVirtual/Mes","IT-NPU-IA-PR-22","IaaS","IaaS Procesamiento","Servidores Virtuales de Alta Capacidad","Gestionado por el proveedor","Debian","Servidor Virtual / Mes",null,"NO","USD",null,null,29701.339200000002,12.876712328767123,5939.9047680000003,13473.736454991094,5894.02,14917.286659599999,14902.447499999998,24714,11708.016799999999,13473.736454991094]
[{"$f":"SUBSTITUTE(C195&D195&E195&F195&G195&H195,\" \",\"\")","v":"IaaSIaaSProcesamientoServidoresVirtualesdeAltaCapacidadGestionadoporelproveedorSUSELinuxEnterpriseServidorVirtual/Mes"},"IT-NPU-IA-PR-23","IaaS","IaaS Procesamiento","Servidores Virtuales de Alta Capacidad","Gestionado por el proveedor","SUSE Linux Enterprise","Servidor Virtual / Mes",null,"NO","USD",null,null,29844.0792,12.876712328767123,6072.9238079999996,13643.462584991095,5982.35,14917.286659599999,15241.1675,25369,11708.016799999999,13643.462584991095]
["IaaSIaaSProcesamientoServidoresVirtualesdeAltaCapacidadGestionadoporelproveedorUbuntuServidorVirtual/Mes","IT-NPU-IA-PR-24","IaaS","IaaS Procesamiento","Servidores Virtuales de Alta Capacidad","Gestionado por el proveedor","Ubuntu","Servidor Virtual / Mes",null,"NO","USD",null,null,29701.339200000002,12.876712328767123,5939.9047680000003,13473.736454991094,5894.02,14917.286659599999,14902.447499999998,24714,11708.016799999999,13473.736454991094]
["IaaSIaaSProcesamientoServidoresVirtualesdeAltaCapacidadGestionadoporelproveedorRedHatEnterpriseServidorVirtual/Mes","IT-NPU-IA-PR-25","IaaS","IaaS Procesamiento","Servidores Virtuales de Alta Capacidad","Gestionado por el proveedor","RedHat Enterprise","Servidor Virtual / Mes",null,"NO","USD",null,null,29825.047199999997,12.876712328767123,6054.7848479999993,13575.345339991096,5998.41,14917.286659599999,15040.052499999998,24940,11814.3048,13575.345339991096]
["IaaSIaaSProcesamientoServidoresVirtualesdeAltaCapacidadGestionadoporelproveedorWindowsServerServidorVirtual/Mes","IT-NPU-IA-PR-26","IaaS","IaaS Procesamiento","Servidores Virtuales de Alta Capacidad","Gestionado por el proveedor","Windows Server","Servidor Virtual / Mes",null,"NO","USD",null,null,33903.604800000001,13.127397260273973,9848.2460159999991,17927.419837007536,8977.5400000000009,20622.899382799998,21134.895499999999,32397,16522.045600000001,17927.419837007536]
["IaaSIaaSProcesamientoServidoresVirtualesdeAltaCapacidadGestionadoporelproveedorWindowsServerDatacenterServidorVirtual/Mes","IT-NPU-IA-PR-27","IaaS","IaaS Procesamiento","Servidores Virtuales de Alta Capacidad","Gestionado por el proveedor","Windows Server Datacenter","Servidor Virtual / Mes",null,"NO","USD",null,null,33903.604800000001,13.127397260273973,9848.2460159999991,17927.419837007536,8977.5400000000009,20622.899382799998,21134.895499999999,32397,16522.045600000001,17927.419837007536]
["ComplementariosCertificadosDigitalesCertificadosdigitalesdefirmadigital-FunciónPúblicaGestionadoporelproveedorN/ACertificadopor1año","IT-NPU-CO-CD-01","Complementarios","Certificados Digitales","Certificados digitales de firma digital - Función Pública","Gestionado por el proveedor","N/A","Certificado por 1 año",null,"NO","Peso Colombiano",null,null,0,320000,790403.02803992236,500000,761600,357000,547066.99433700193,790403.02803992236,500000,0]
["ComplementariosCertificadosDigitalesCertificadosdigitalesdefirmadigital-FunciónPúblicaGestionadoporelproveedorN/ACertificadopor2años","IT-NPU-CO-CD-02","Complementarios","Certificados Digitales","Certificados digitales de firma digital - Función Pública","Gestionado por el proveedor","N/A","Certificado por 2 años",null,"NO","Peso Colombiano",null,null,0,562500,1567725.3998416211,1000000,1523200,714000,961641.20098301116,1567725.3998416211,1000000,0]
["ComplementariosCertificadosDigitalesCertificadosdigitalesdefirmadigital-FunciónPúblicaGestionadoporelproveedorN/ACertificadopor3años","IT-NPU-CO-CD-03","Complementarios","Certificados Digitales","Certificados digitales de firma digital - Función Pública","Gestionado por el proveedor","N/A","Certificado por 3 años",null,"NO","Peso Colombiano",null,null,0,937500,2436229.533928284,2436229.533928284,2284800,1071000,1508708.195320013,2436229.533928284,1500000,0]
["ComplementariosCertificadosDigitalesCertificadosdigitalesdefirmadigital-PersonaJurídicaGestionadoporelproveedorN/ACertificadopor1año","IT-NPU-CO-CD-04","Complementarios","Certificados Digitales","Certificados digitales de firma digital - Persona Jurídica","Gestionado por el proveedor","N/A","Certificado por 1 año",null,"NO","Peso Colombiano",null,null,0,1000000,1679528.5564010765,1600000,761600,1570800,1679528.5564010765,1101700,1600000,0]
["ComplementariosCertificadosDigitalesCertificadosdigitalesdefirmadigital-PersonaJurídicaGestionadoporelproveedorN/ACertificadopor2años","IT-NPU-CO-CD-05","Complementarios","Certificados Digitales","Certificados digitales de firma digital - Persona Jurídica","Gestionado por el proveedor","N/A","Certificado por 2 años",null,"NO","Peso Colombiano",null,null,0,2000000,3359057.112802153,3200000,1523200,3141600,3359057.112802153,2203400,3200000,0]
["ComplementariosCertificadosDigitalesCertificadosdigitalesdefirmadigital-PersonaJurídicaGestionadoporelproveedorN/ACertificadopor3años","IT-NPU-CO-CD-06","Complementarios","Certificados Digitales","Certificados digitales de firma digital - Persona Jurídica","Gestionado por el proveedor","N/A","Certificado por 3 años",null,"NO","Peso Colombiano",null,null,0,3000000,4932333.2397727985,4932333.2397727985,2284800,4712400,4932333.2397727985,3305099.9999999995,4800000,0]
["ComplementariosCertificadosDigitalesCertificadosdigitalesdefirmadigital-PertenenciaaEmpresaGestionadoporelproveedorN/ACertificadopor1año","IT-NPU-CO-CD-07","Complementarios","Certificados Digitales","Certificados digitales de firma digital - Pertenencia a Empresa","Gestionado por el proveedor","N/A","Certificado por 1 año",null,"NO","Peso Colombiano",null,null,0,320000,866088.88182227523,866088.88182227523,761600,357000,547066.99433700193,866088.88182227523,700000,0]
["ComplementariosCertificadosDigitalesCertificadosdigitalesdefirmadigital-PertenenciaaEmpresaGestionadoporelproveedorN/ACertificadopor2años","IT-NPU-CO-CD-08","Complementarios","Certificados Digitales","Certificados digitales de firma digital - Pertenencia a Empresa","Gestionado por el proveedor","N/A","Certificado por 2 años",null,"NO","Peso Colombiano",null,null,0,562500,1728190.3597951848,1728190.3597951848,1523200,714000,961641.20098301116,1728190.3597951848,1400000,0]
["ComplementariosCertificadosDigitalesCertificadosdigitalesdefirmadigital-PertenenciaaEmpresaGestionadoporelproveedorN/ACertificadopor3años","IT-NPU-CO-CD-09","Complementarios","Certificados Digitales","Certificados digitales de firma digital - Pertenencia a Empresa","Gestionado por el proveedor","N/A","Certificado por 3 años",null,"NO","Peso Colombiano",null,null,0,937500,3247934.0635547689,3247934.0635547689,2284800,1071000,1508708.195320013,2732400,3247934.0635547689,0]
["ComplementariosCertificadosDigitalesCertificadosdigitalesdefirmadigital-RepresentacióndeEmpresaGestionadoporelproveedorN/ACertificadopor1año","IT-NPU-CO-CD-10","Complementarios","Certificados Digitales","Certificados digitales de firma digital - Representación de Empresa","Gestionado por el proveedor","N/A","Certificado por 1 año",null,"NO","Peso Colombiano",null,null,0,320000,841584.95867495961,700000,761600,357000,547066.99433700193,827999.99999999988,841584.95867495961,0]
["ComplementariosCertificadosDigitalesCertificadosdigitalesdefirmadigital-RepresentacióndeEmpresaGestionadoporelproveedorN/ACertificadopor2años","IT-NPU-CO-CD-11","Complementarios","Certificados Digitales","Certificados digitales de firma digital - Representación de Empresa","Gestionado por el proveedor","N/A","Certificado por 2 años",null,"NO","Peso Colombiano",null,null,0,562500,1679070.3043372536,1400000,1523200,714000,961641.20098301116,1655999.9999999998,1679070.3043372536,0]
["ComplementariosCertificadosDigitalesCertificadosdigitalesdefirmadigital-RepresentacióndeEmpresaGestionadoporelproveedorN/ACertificadopor3años","IT-NPU-CO-CD-12","Complementarios","Certificados Digitales","Certificados digitales de firma digital - Representación de Empresa","Gestionado por el proveedor","N/A","Certificado por 3 años",null,"NO","Peso Colombiano",null,null,0,937500,3788477.8069167696,3788477.8069167696,2284800,1071000,1508708.195320013,2484000,3788477.8069167696,0]

{"sheet":"Cuadro Totales","index":7,"n_rows":12,"n_cols":9,"rows_kept":12,"cut":false,"hidden":true,"merged":[[0,0,0,5],[7,0,7,8]]}
["Valores"]
["Valor Unitario","Precio maximo autorizado","Valor X Capacidad","Precio Total","IVA","Total"]
[]
[]
[null,null,null,"Total Servicios","IVA","Total"]
[]
[]
["Valores"]
["Valor Unitario","Precio maximo autorizado","Descuento adicional","Precio con Descuento","Valor X Capacidad","Precio Total","Incluir IVA","IVA","Total"]
[]
[]
[null,null,null,null,null,"Total Servicios",null,"IVA","Total"]

{"sheet":"ListaProveedores","index":8,"n_rows":8,"n_cols":1,"rows_kept":8,"cut":false,"hidden":true,"merged":[]}
["ProveedorServicios"]
["Avanxo - Segm 1. Amazon"]
["UT Goldsvada - Segm 1. Amazon"]
["Hightech - Segm 1. Amazon"]
["S3 SAS - Segm 1. Amazon"]
["UT Gestion integral cloud - Segm 1. Amazon"]
["UT Nubepublica2019 - Segm 1. Amazon"]
["Clouxter - Segm 1. Amazon"]

{"sheet":"tempProveedores","index":9,"n_rows":7,"n_cols":1,"rows_kept":7,"cut":false,"hidden":true,"merged":[]}
["Avanxo - Segm 1. Amazon"]
["UT Goldsvada - Segm 1. Amazon"]
["Hightech - Segm 1. Amazon"]
["S3 SAS - Segm 1. Amazon"]
["UT Gestion integral cloud - Segm 1. Amazon"]
["UT Nubepublica2019 - Segm 1. Amazon"]
["Clouxter - Segm 1. Amazon"]

{"sheet":"ListasAutomaticas","index":10,"n_rows":178,"n_cols":1,"rows_kept":178,"cut":false,"hidden":true,"merged":[]}
["codservicio"]
["CO-AD-01-01"]
["CO-AD-01-02"]
["CO-AD-01-03"]
["CO-AD-01-04"]
["CO-AD-02-01"]
["CO-AD-02-02"]
["CO-AD-02-03"]
["CO-AD-02-04"]
["CO-EX-01-01"]
["CO-EX-01-02"]
["CO-EX-01-03"]
["CO-EX-01-04"]
["CO-EX-02-01"]
["CO-EX-02-02"]
["CO-EX-02-03"]
["CO-EX-02-04"]
["CO-EX-03-01"]
["CO-EX-03-02"]
["CO-EX-03-03"]
["CO-EX-03-04"]
["CO-EX-04-01"]
["CO-EX-04-02"]
["CO-EX-04-03"]
["CO-EX-04-04"]
["CO-EX-05-01"]
["CO-EX-05-02"]
["CO-EX-05-03"]
["CO-EX-05-04"]
["CO-EX-06-01"]
["CO-EX-06-02"]
["CO-EX-06-03"]
["CO-EX-06-04"]
["CO-EX-07-01"]
["CO-EX-07-02"]
["CO-EX-07-03"]
["CO-EX-07-04"]
["CO-EX-08-01"]
["CO-EX-08-02"]
["CO-EX-08-03"]
["CO-EX-08-04"]
["CO-EX-09-01"]
["CO-EX-09-02"]
["CO-EX-09-03"]
["CO-EX-09-04"]
["CO-EX-10-01"]
["CO-EX-10-02"]
["CO-EX-10-03"]
["CO-EX-10-04"]
["CO-EX-11-01"]
["CO-EX-11-02"]
["CO-EX-11-03"]
["CO-EX-11-04"]
["CO-EX-12-01"]
["CO-EX-12-02"]
["CO-EX-12-03"]
["CO-EX-12-04"]
["CO-EX-13-01"]
["CO-EX-13-02"]
["CO-EX-13-03"]
["CO-EX-13-04"]
["CO-EX-14-01"]
["CO-EX-14-02"]
["CO-EX-14-03"]
["CO-EX-14-04"]
["CO-EX-15-01"]
["CO-EX-15-02"]
["CO-EX-15-03"]
["CO-EX-15-04"]
["CO-EX-16-01"]
["CO-EX-16-02"]
["CO-EX-16-03"]
["CO-EX-16-04"]
["CO-EX-17-01"]
["CO-EX-17-02"]
["CO-EX-17-03"]
["CO-EX-17-04"]
["CO-EX-18-01"]
["CO-EX-18-02"]
["CO-EX-18-03"]
["CO-EX-18-04"]
["CO-EX-19-01"]
["CO-EX-19-02"]
["CO-EX-19-03"]
["CO-EX-19-04"]
["CO-EX-20-01"]
["CO-EX-20-02"]
["CO-EX-20-03"]
["CO-EX-20-04"]
["CO-EX-21-01"]
["CO-EX-21-02"]
["CO-EX-21-03"]
["CO-EX-21-04"]
["CO-EX-22-01"]
["CO-EX-22-02"]
["CO-EX-22-03"]
["CO-EX-22-04"]
["CO-EX-23-01"]
["CO-EX-23-02"]
["CO-EX-23-03"]
["CO-EX-23-04"]
["CO-EX-24-01"]
["CO-EX-24-02"]
["CO-EX-24-03"]
["CO-EX-24-04"]
["CO-EX-25-01"]
["CO-EX-25-02"]
["CO-EX-25-03"]
["CO-EX-25-04"]
["CO-EX-26-01"]
["CO-EX-26-02"]
["CO-EX-26-03"]
["CO-EX-26-04"]
["CO-EX-27-01"]
["CO-EX-27-02"]
["CO-EX-27-03"]
["CO-EX-27-04"]
["CO-EX-28-01"]
["CO-EX-28-02"]
["CO-EX-28-03"]
["CO-EX-28-04"]
["CO-EX-29-01"]
["CO-EX-29-02"]
["CO-EX-29-03"]
["CO-EX-29-04"]
["CO-EX-30-01"]
["CO-EX-30-02"]
["CO-EX-30-03"]
["CO-EX-30-04"]
["CO-EX-31-01"]
["CO-EX-31-02"]
["CO-EX-31-03"]
["CO-EX-31-04"]
["CO-EX-32-01"]
["CO-EX-32-02"]
["CO-EX-32-03"]
["CO-EX-32-04"]
["CO-EX-33-01"]
["CO-EX-33-02"]
["CO-EX-33-03"]
["CO-EX-33-04"]
["CO-EX-34-01"]
["CO-EX-34-02"]
["CO-EX-34-03"]
["CO-EX-34-04"]
["CO-EX-35-01"]
["CO-EX-35-02"]
["CO-EX-35-03"]
["CO-EX-35-04"]
["CO-EX-36-01"]
["CO-EX-36-02"]
["CO-EX-36-03"]
["CO-EX-36-04"]
["CO-MI-02"]
["CO-SL-01-01"]
["CO-SL-01-02"]
["CO-SL-01-03"]
["CO-SL-01-04"]
["CO-SL-01-05"]
["CO-SL-01-06"]
["CO-SL-01-07"]
["CO-SL-01-08"]
["CO-SL-02-01"]
["CO-SL-02-02"]
["CO-SL-02-03"]
["CO-SL-02-04"]
["CO-SL-03-01"]
["CO-SL-03-02"]
["CO-SL-03-03"]
["CO-SL-03-04"]
["CO-SL-04-01"]
["CO-SL-04-02"]
["CO-SL-04-03"]
["CO-SL-04-04"]
["CO-SO-01-01"]
["CO-SO-01-02"]
["CO-SO-02-01"]
["CO-SO-02-02"]

{"sheet":"Parametros","index":11,"n_rows":1,"n_cols":2,"rows_kept":1,"cut":false,"hidden":true,"merged":[]}
["Limite de filas",240]

{"sheet":"CSV","index":12,"n_rows":5,"n_cols":8,"rows_kept":5,"cut":false,"hidden":true,"merged":[]}
["Tipo (servicio o artÃ­culo)","Cantidad","CÃ³digo de unidad de medida*","PosiciÃ³n","Precio base","Divisa","DescripciÃ³n","MercancÃ­a"]
["item",1,"Und",null,"\"295151100,9328\"","COP","npu03--CO-NP-01 - Servicios en la Nube-NA_NA-NA - 1 Unidad"]
["item",1,"Und",null,"\"35418132,1119\"","COP","npu03--CO-GE-01 - Tasa de intermediaciÃ³n para servicios autogestionados-Servicio de ComputaciÃ³n en la Nube_NA-NA - 1 Tasa"]
["item",2,"Hora",null,"\"103572,6141\"","COP","npu03--CO-MI-01 - Servicio de PreparaciÃ³n para la migraciÃ³n-Servicios de migraciÃ³n_NA-NA - 1 Precio por hora"]
["item",1,"Und",null,"\"6768802,69\"","COP","npu03--IVA"]