{"text_format":"1","workbook":"xlsx","n_sheets":13,"sheets":["SolCotizacion","Anexo","ResumenCotizacion","Cotizacion","Consolidado","temp","Servicios","Cuadro Totales","ListaProveedores","tempProveedores","ListasAutomaticas","Parametros","CSV"],"not_rendered":{"charts":0,"images":2,"macros":1,"external_links":0,"defined_names":7,"comments":0,"pivot_tables":0},"unopened":[],"bounds":{"document_bytes":16777216,"sheet_cells":100000,"rows_first":2000,"rows_last":500,"rows_between":2000,"halvings":0,"cell_chars":16384,"cell_head_chars":4096},"cells_cut":0,"cells_raw":0,"read":"whole","date_system":"1900"}

{"sheet":"SolCotizacion","index":0,"n_rows":47,"n_cols":14,"rows_kept":47,"cut":false,"hidden":false,"merged":[[42,2,42,5],[43,2,43,5],[41,2,41,5],[27,1,27,3],[30,3,30,4],[30,5,30,6],[29,1,29,12],[31,3,31,4],[31,5,31,6],[33,3,33,4],[33,5,33,6],[32,5,32,6],[14,1,14,12],[5,11,5,12],[7,11,7,12],[9,11,9,12],[3,1,3,12],[11,1,11,3],[1,1,1,12],[5,4,5,6],[7,4,7,6],[9,4,9,6],[11,4,11,6],[21,12,22,12],[21,11,22,11],[20,1,20,3],[23,1,23,3],[16,1,16,3],[16,9,16,10],[18,5,18,7],[20,5,20,7],[21,5,22,7],[23,5,23,7],[24,1,24,3],[18,1,18,3],[21,1,22,3],[21,4,22,4],[32,3,32,4],[24,5,24,7],[18,8,18,10],[21,8,21,10],[22,8,22,10],[23,8,23,10],[24,8,24,10]]}
[]
[null,"Solicitud de Cotización\nNube Pública 3G"]
[null,null,"Versión: 10","2020-02-26"]
[null,"Información de la Entidad Compradora"]
[]
[null,"Nombre de la Entidad",null,null,"UNIVERSIDAD DISTRITAL FRANCISCO JOSÉ DE CALDAS",null,null,null,null,"NIT",null,"899999230-7"]
[]
[null,"Dirección de la Entidad",null,null,"Carrera 7 N. 40B 53",null,null,null,null,"Correo de contacto",null,"planesticud@udistrital.edu.co"]
[]
[null,"Municipio",null,null,"Bogotá D.C.",null,null,null,null,"Teléfono de contacto",null," 3239300 Ext. 6338"]
{"$rows_left_out":38}
{"sheet":"Anexo","index":1,"n_rows":26,"n_cols":3,"rows_kept":26,"cut":false,"hidden":false,"merged":[[7,1,7,2],[8,1,8,2],[9,1,9,2],[1,0,1,2],[2,0,2,2],[3,0,3,2],[4,0,4,2],[5,1,5,2],[6,1,6,2]]}
[]
["Con el objetivo de complementar el entendimiento sobre la solicitud de Servicios de Centos de Contacto , por favor diligencie la totalidad de la información que se pide a continuación."]
[]
["Tenga en cuenta que esta información es de utilidad para que el Proveedor pueda cotizar de la manera más precisa posible los servicios solicitados, por lo cual la exactitud y completitud es muy importante."]
[]
["Entidad solicitante"]
["Nit"]
["Contacto técnico"]
["Correo contacto técnico"]
["Teléfono contacto técnico"]
{"$rows_left_out":17}
{"sheet":"ResumenCotizacion","index":2,"n_rows":47,"n_cols":20,"rows_kept":47,"cut":false,"hidden":false,"merged":[[29,13,29,18],[33,3,33,4],[33,5,33,6],[41,2,41,5],[42,2,42,5],[43,2,43,5],[30,3,30,4],[30,5,30,6],[31,3,31,4],[31,5,31,6],[32,3,32,4],[32,5,32,6],[24,1,24,3],[24,5,24,7],[24,8,24,10],[27,1,27,3],[29,1,29,12],[21,8,21,10],[21,11,22,11],[21,12,22,12],[22,8,22,10],[23,1,23,3],[23,5,23,7],[23,8,23,10],[20,1,20,3],[20,5,20,7],[21,1,22,3],[21,4,22,4],[21,5,22,7],[16,1,16,3],[16,9,16,10],[18,1,18,3],[18,5,18,7],[18,8,18,10],[14,1,14,12],[1,1,1,12],[5,4,5,6],[7,4,7,6],[9,4,9,6],[11,1,11,3],[11,4,11,6],[3,1,3,12],[5,11,5,12],[7,11,7,12],[9,11,9,12]]}
[]
[null,"Solicitud de Cotización\nNube Pública 2G"]
[]
[null,"Información de la Entidad Compradora"]
[]
[null,"Nombre de la Entidad",null,null,{"$f":"SolCotizacion!E6","v":"UNIVERSIDAD DISTRITAL FRANCISCO JOSÉ DE CALDAS"},null,null,null,null,"NIT",null,{"$f":"SolCotizacion!L6","v":"899999230-7"}]
[]
[null,"Dirección de la Entidad",null,null,{"$f":"SolCotizacion!E8","v":"Carrera 7 N. 40B 53"},null,null,null,null,"Correo de contacto",null,{"$f":"SolCotizacion!L8","v":"planesticud@udistrital.edu.co"}]
[]
[null,"Municipio",null,null,{"$f":"SolCotizacion!E10","v":"Bogotá D.C."},null,null,null,null,"Teléfono de contacto",null,{"$f":"SolCotizacion!L10","v":" 3239300 Ext. 6338"}]
{"$rows_left_out":38}
{"sheet":"Cotizacion","index":3,"n_rows":47,"n_cols":22,"rows_kept":47,"cut":false,"hidden":false,"merged":[[29,13,29,21],[33,3,33,4],[33,5,33,6],[41,2,41,5],[42,2,42,5],[43,2,43,5],[30,3,30,4],[30,5,30,6],[31,3,31,4],[31,5,31,6],[32,3,32,4],[32,5,32,6],[24,1,24,3],[24,5,24,7],[24,8,24,10],[27,1,27,3],[29,1,29,12],[21,8,21,10],[21,11,22,11],[21,12,22,12],[22,8,22,10],[23,1,23,3],[23,5,23,7],[23,8,23,10],[20,1,20,3],[20,5,20,7],[21,1,22,3],[21,4,22,4],[21,5,22,7],[16,1,16,3],[16,9,16,10],[18,1,18,3],[18,5,18,7],[18,8,18,10],[14,1,14,12],[15,1,15,3],[15,4,15,6],[1,1,1,12],[5,4,5,6],[7,4,7,6],[9,4,9,6],[11,1,11,3],[11,4,11,6],[3,1,3,12],[5,11,5,12],[7,11,7,12],[9,11,9,12]]}
[{"$f":"SolCotizacion!$L$17","v":3858.56}]
[null,"Solicitud de Cotización\nNube Pública 2G"]
[]
[null,"Información de la Entidad Compradora"]
[]
[null,"Nombre de la Entidad",null,null,{"$f":"SolCotizacion!E6","v":"UNIVERSIDAD DISTRITAL FRANCISCO JOSÉ DE CALDAS"},null,null,null,null,"NIT",null,{"$f":"SolCotizacion!L6","v":"899999230-7"}]
[]
[null,"Dirección de la Entidad",null,null,{"$f":"SolCotizacion!E8","v":"Carrera 7 N. 40B 53"},null,null,null,null,"Correo de contacto",null,{"$f":"SolCotizacion!L8","v":"planesticud@udistrital.edu.co"}]
[]
[null,"Municipio",null,null,{"$f":"SolCotizacion!E10","v":"Bogotá D.C."},null,null,null,null,"Teléfono de contacto",null,{"$f":"SolCotizacion!L10","v":" 3239300 Ext. 6338"}]
{"$rows_left_out":38}
{"sheet":"Consolidado","index":4,"n_rows":183,"n_cols":28,"rows_kept":183,"cut":false,"hidden":true,"merged":[]}
["Código del servicio","Nombre del servicio","Tipo de servicio","Característica 1","Característica 2","Unidad","Unidad TVEC","IVA","Avanxo - Segm 1. Amazon","Soluciones Orion - Segm 2. Google","UT Goldsvada - Segm 1. Amazon","Hightech - Segm 1. Amazon","UT Tecnologia Oracle Eficiente - Segm 5. Oracle","Colombia telecomunicaciones SA - Segm 4. Microsoft","Colsof - Segm 4. Microsoft","Mercanet SAS - Segm 4. Microsoft","Comcel - Segm 4. Microsoft","SETI - Segm 5. Oracle","Eforcers - Segm 2. Google","informacion localizada - Segm 2. Google","S3 SAS - Segm 1. Amazon","UT DPN 2019 - Segm 5. Oracle","UT Gestion integral cloud - Segm 1. Amazon","UT TAKWC - Segm 5. Oracle","UT Nubepublica2019 - Segm 1. Amazon","UT Nubepublica2019 - Segm 4. Microsoft","Clouxter - Segm 1. Amazon","Controles empresariales - Segm 4. Microsoft"]
["CO-GE-01","Tasa de intermediación para servicios autogestionados","Servicio de Computación en la Nube","NA","NA","Tasa","Und","SI",0.12,0.12,0.15,0.06,9.8000000000000004E-2,0.08,0,3.9E-2,5.0000000000000001E-4,0.12,0.01,0,1E-3,0.22,0.1,0.06,0.1,0.1,0.01,0.19]
["CO-GE-02","Tasa de intermediación para servicios gestionados por el Proveedor","Servicio de Computación en la Nube","NA","NA","Tasa","Und","SI",0.19,0.22,0.3,0.6,0.13800000000000001,0.13,0,5.5E-2,0.5,0.1,0.17,0.15,1E-3,0.28000000000000003,0.12,0.06,0.19,0.19,0.2,0.24]
["CO-GE-03","Tasa de descuento ofrecido por el proponente sobre el precio de los servicios de computación en la nube",null,"NA","NA","Tasa","Und","SI",0.02,0.02,0.1,0.05,1.0999999999999999E-2,0.15,0.1,9.5000000000000001E-2,0.08,0.02,0.02,0.02,0,5.0000000000000001E-3,0.04,0.03,7.0000000000000007E-2,7.0000000000000007E-2,0.01,0.04]
["CO-AD-01-01","Sesión formación o capacitación - remoto","Servicios profesionales","NA","NA","Precio por sesión (sesión de 4 horas hasta 10 asistentes)","Sesion","SI",347942.88,496080,836976,2120000,1198224,627338.74,1113000,366336,1958894.84,876581.84000000008,3243600,1904791.3800000001,659564.30783400743,1821461.6,576640,3737621.4621920004,757158,757158,407040,1534091.36]
["CO-AD-01-02","Sesión formación o capacitación - zona 1","Servicios profesionales","NA","NA","Precio por sesión (sesión de 4 horas hasta 10 asistentes)","Sesion","SI",549766.88,545688.00000000012,2175544,3710000,1463224,658828.16,1309418,439603.20000000001,2350674.02,1236735.3587300002,3243600,2242536,936925.24468598701,3531920,720800,4049090.4370220001,1055018,1055018,424000,1687499.86]
["CO-AD-01-03","Sesión formación o capacitación - zona 2","Servicios profesionales","NA","NA","Precio por sesión (sesión de 4 horas hasta 10 asistentes)","Sesion","SI",665094.88,580413.6,2415952,4240000,1516224,690873.02,1590000,517754.88,3134232.3800000004,1236735.3587300002,3243600,3918505.18,1491647.1183899459,3531920,1153280,4983495.579864,1294260,1294260,508800,1840909.4200000002]
["CO-AD-01-04","Sesión formación o capacitación - zona 3","Servicios profesionales","NA","NA","Precio por sesión (sesión de 4 horas hasta 10 asistentes)","Sesion","SI",708342.88,605217.6,2656360,4770000,1728224,721501.72000000009,1590000,558784.51199999999,3917789.68,1236735.3587300002,3243600,4485072,3294493.2079278128,3531920,1441600,6229368.8067120006,1499158,1499158,508800,1994318.9800000002]
["CO-AD-02-01","Experto para la definición, análisis y adopción de Nube Pública - remoto","Servicios profesionales","NA","NA","Precio por hora","Hora","SI",269876,124020,209244,254400,249630,156970.1,265212,57240,178245.04751200002,205274.30000000002,396440,191860,249208.80176150365,455365.4,180200,249174.82349200002,138860,138860,201188,191761.42]
["CO-AD-02-02","Experto para la definición, análisis y adopción de Nube Pública - zona 1","Servicios profesionales","NA","NA","Precio por hora","Hora","SI",330296,136422.00000000003,469686,307400,315880,156970.1,398242,114480,207952.55546599999,250293.56000000003,396440,234260,318549.03597449849,567630,216240,373762.23534400004,238500,238500,201188,210936.82]
{"$rows_left_out":174}
{"sheet":"temp","index":5,"n_rows":7,"n_cols":56,"rows_kept":7,"cut":false,"hidden":true,"merged":[]}
["Código del servicio","Nombre del servicio","Tipo de servicio","Característica 1","Característica 2","Unidad","Unidad TVEC","IVA","Avanxo - Segm 1. Amazon","Soluciones Orion - Segm 2. Google","UT Goldsvada - Segm 1. Amazon","Hightech - Segm 1. Amazon","UT Tecnologia Oracle Eficiente - Segm 5. Oracle","Colombia telecomunicaciones SA - Segm 4. Microsoft","Colsof - Segm 4. Microsoft","Mercanet SAS - Segm 4. Microsoft","Comcel - Segm 4. Microsoft","SETI - Segm 5. Oracle","Eforcers - Segm 2. Google","informacion localizada - Segm 2. Google","S3 SAS - Segm 1. Amazon","UT DPN 2019 - Segm 5. Oracle","UT Gestion integral cloud - Segm 1. Amazon","UT TAKWC - Segm 5. Oracle","UT Nubepublica2019 - Segm 1. Amazon","UT Nubepublica2019 - Segm 4. Microsoft","Clouxter - Segm 1. Amazon","Controles empresariales - Segm 4. Microsoft",null,null,"capacidad","cant en tiempo",{"$f":"\"V\"&I1","v":"VAvanxo - Segm 1. Amazon"},{"$f":"\"V\"&J1","v":"VSoluciones Orion - Segm 2. Google"},"VUT Goldsvada - Segm 1. Amazon","VHightech - Segm 1. Amazon","VUT Tecnologia Oracle Eficiente - Segm 5. Oracle","VColombia telecomunicaciones SA - Segm 4. Microsoft","VColsof - Segm 4. Microsoft","VMercanet SAS - Segm 4. Microsoft","VComcel - Segm 4. Microsoft","VSETI - Segm 5. Oracle","VEforcers - Segm 2. Google","Vinformacion localizada - Segm 2. Google","VS3 SAS - Segm 1. Amazon","VUT DPN 2019 - Segm 5. Oracle","VUT Gestion integral cloud - Segm 1. Amazon","VUT TAKWC - Segm 5. Oracle","VUT Nubepublica2019 - Segm 1. Amazon","VUT Nubepublica2019 - Segm 4. Microsoft","VClouxter - Segm 1. Amazon","VControles empresariales - Segm 4. Microsoft","vmin","v+grava","xcapacidad","total"]
["CO-GE-01","Tasa de intermediación para servicios autogestionados","Servicio de Computación en la Nube","NA","NA","Tasa","Und","SI",0.12,0.12,0.15,0.06,9.8000000000000004E-2,0.08,0,3.9E-2,5.0000000000000001E-4,0.12,0.01,0,1E-3,0.22,0.1,0.06,0.1,0.1,0.01,0.19,null,null,{"$f":"SUMIF(ResumenCotizacion!$C:$C,temp!A2,ResumenCotizacion!$J:$J)","v":1},{"$f":"SUMIF(ResumenCotizacion!$C:$C,temp!A2,ResumenCotizacion!$L:$L)","v":1},{"$f":"$AE2*$AF2*I2","v":0.12},{"$f":"$AE2*$AF2*J2","v":0.12},0.15,0.06,9.8000000000000004E-2,0.08,0,3.9E-2,5.0000000000000001E-4,0.12,0.01,0,1E-3,0.22,0.1,0.06,0.1,0.1,0.01,0.19,0.12,{"$f":"BA2/(1-VLOOKUP(\"Total porcentaje:\",ResumenCotizacion!$F:$G,2,0))","v":0.12448132780082988},{"$f":"ROUND(AE2*BB2,2)","v":0.12},{"$f":"ROUND(AF2*BC2,2)","v":0.12}]
["CO-MI-01","Servicio de Preparación para la migración","Servicios de migración","NA","NA","Precio por hora","Hora","SI",99844,117000,499800,180000,463150,148085,392000,108000,224207.60690000001,414102,170000,221000,139203.79094835199,429590,136000,470141.1765,178600,178600,109800,209174,null,null,{"$f":"SUMIF(ResumenCotizacion!$C:$C,temp!A3,ResumenCotizacion!$J:$J)","v":1},{"$f":"SUMIF(ResumenCotizacion!$C:$C,temp!A3,ResumenCotizacion!$L:$L)","v":2},{"$f":"$AE3*$AF3*I3","v":199688},{"$f":"$AE3*$AF3*J3","v":234000},{"$f":"$AE3*$AF3*K3","v":999600},{"$f":"$AE3*$AF3*L3","v":360000},{"$f":"$AE3*$AF3*M3","v":926300},{"$f":"$AE3*$AF3*N3","v":296170},{"$f":"$AE3*$AF3*O3","v":784000},{"$f":"$AE3*$AF3*P3","v":216000},{"$f":"$AE3*$AF3*Q3","v":448415.21380000003},{"$f":"$AE3*$AF3*R3","v":828204},{"$f":"$AE3*$AF3*S3","v":340000},{"$f":"$AE3*$AF3*T3","v":442000},{"$f":"$AE3*$AF3*U3","v":278407.58189670398},{"$f":"$AE3*$AF3*V3","v":859180},{"$f":"$AE3*$AF3*W3","v":272000},{"$f":"$AE3*$AF3*X3","v":940282.353},{"$f":"$AE3*$AF3*Y3","v":357200},{"$f":"$AE3*$AF3*Z3","v":357200},{"$f":"$AE3*$AF3*AA3","v":219600},{"$f":"$AE3*$AF3*AB3","v":418348},99844,{"$f":"BA3/(1-VLOOKUP(\"Total porcentaje:\",ResumenCotizacion!$F:$G,2,0))","v":103572.61410788383},{"$f":"ROUND(AE3*BB3,2)","v":103572.61},207145.22]
["CO-NP-01","Servicios en la Nube","NA","NA","NA","Unidad","Und","No",284525661.2992,0,284525661.2992,284525661.2992,0,0,0,0,0,0,0,0,284525661.2992,0,284525661.2992,0,284525661.2992,0,284525661.2992,0,null,null,{"$f":"SUMIF(ResumenCotizacion!$C:$C,temp!A4,ResumenCotizacion!$J:$J)","v":1},{"$f":"SUMIF(ResumenCotizacion!$C:$C,temp!A4,ResumenCotizacion!$L:$L)","v":1},284525661.2992,0,284525661.2992,284525661.2992,0,0,0,0,0,0,0,0,284525661.2992,0,284525661.2992,0,284525661.2992,0,284525661.2992,0,284525661.2992,{"$f":"BA4/(1-VLOOKUP(\"Total porcentaje:\",ResumenCotizacion!$F:$G,2,0))","v":295151100.93278009},{"$f":"ROUND(AE4*BB4,2)","v":295151100.93000001},295151100.93000001]
[null,null,null,null,null,null,null,null,null,null,null,null,null,null,null,null,null,null,null,null,null,null,null,null,null,null,null,null,null,null,null,null,{"$f":"IF(AND(AG$3:AG4>0),SUM(AG$3:AG4),0)","v":284725349.2992},{"$f":"IF(AND(AH$3:AH4>0),SUM(AH$3:AH4),0)","v":0},{"$f":"IF(AND(AI$3:AI4>0),SUM(AI$3:AI4),0)","v":285525261.2992},{"$f":"IF(AND(AJ$3:AJ4>0),SUM(AJ$3:AJ4),0)","v":284885661.2992},{"$f":"IF(AND(AK$3:AK4>0),SUM(AK$3:AK4),0)","v":0},{"$f":"IF(AND(AL$3:AL4>0),SUM(AL$3:AL4),0)","v":0},{"$f":"IF(AND(AM$3:AM4>0),SUM(AM$3:AM4),0)","v":0},{"$f":"IF(AND(AN$3:AN4>0),SUM(AN$3:AN4),0)","v":0},{"$f":"IF(AND(AO$3:AO4>0),SUM(AO$3:AO4),0)","v":0},{"$f":"IF(AND(AP$3:AP4>0),SUM(AP$3:AP4),0)","v":0},{"$f":"IF(AND(AQ$3:AQ4>0),SUM(AQ$3:AQ4),0)","v":0},{"$f":"IF(AND(AR$3:AR4>0),SUM(AR$3:AR4),0)","v":0},{"$f":"IF(AND(AS$3:AS4>0),SUM(AS$3:AS4),0)","v":284804068.88109672},{"$f":"IF(AND(AT$3:AT4>0),SUM(AT$3:AT4),0)","v":0},{"$f":"IF(AND(AU$3:AU4>0),SUM(AU$3:AU4),0)","v":284797661.2992},{"$f":"IF(AND(AV$3:AV4>0),SUM(AV$3:AV4),0)","v":0},{"$f":"IF(AND(AW$3:AW4>0),SUM(AW$3:AW4),0)","v":284882861.2992},{"$f":"IF(AND(AX$3:AX4>0),SUM(AX$3:AX4),0)","v":0},{"$f":"IF(AND(AY$3:AY4>0),SUM(AY$3:AY4),0)","v":284745261.2992},{"$f":"IF(AND(AZ$3:AZ4>0),SUM(AZ$3:AZ4),0)","v":0},null,null,null,{"$f":"SUM(BD$2:BD4)","v":295358246.26999998}]
[null,null,null,null,null,null,null,null,null,null,null,null,null,null,null,null,null,null,null,null,null,null,null,null,null,null,null,null,null,null,null,null,{"$f":"MIN(IF($AG5:$AV5<>0,$AG5:$AV5))","v":284725349.2992},{"$f":"MIN(IF($AG5:$AV5<>0,$AG5:$AV5))","v":284725349.2992},{"$f":"MIN(IF($AG5:$AV5<>0,$AG5:$AV5))","v":284725349.2992},{"$f":"MIN(IF($AG5:$AV5<>0,$AG5:$AV5))","v":284725349.2992},{"$f":"MIN(IF($AG5:$AV5<>0,$AG5:$AV5))","v":284725349.2992},{"$f":"MIN(IF($AG5:$AV5<>0,$AG5:$AV5))","v":284725349.2992},{"$f":"MIN(IF($AG5:$AV5<>0,$AG5:$AV5))","v":284725349.2992},{"$f":"MIN(IF($AG5:$AV5<>0,$AG5:$AV5))","v":284725349.2992},{"$f":"MIN(IF($AG5:$AV5<>0,$AG5:$AV5))","v":284725349.2992},{"$f":"MIN(IF($AG5:$AV5<>0,$AG5:$AV5))","v":284725349.2992},{"$f":"MIN(IF($AG5:$AV5<>0,$AG5:$AV5))","v":284725349.2992},{"$f":"MIN(IF($AG5:$AV5<>0,$AG5:$AV5))","v":284725349.2992},{"$f":"MIN(IF($AG5:$AV5<>0,$AG5:$AV5))","v":284725349.2992},{"$f":"MIN(IF($AG5:$AV5<>0,$AG5:$AV5))","v":284725349.2992},{"$f":"MIN(IF($AG5:$AV5<>0,$AG5:$AV5))","v":284725349.2992},{"$f":"MIN(IF($AG5:$AV5<>0,$AG5:$AV5))","v":284725349.2992},{"$f":"MIN(IF($AG5:$AV5<>0,$AG5:$AV5))","v":284725349.2992},{"$f":"MIN(IF($AG5:$AV5<>0,$AG5:$AV5))","v":284725349.2992},{"$f":"MIN(IF($AG5:$AV5<>0,$AG5:$AV5))","v":284725349.2992},{"$f":"MIN(IF($AG5:$AV5<>0,$AG5:$AV5))","v":284725349.2992},null,null,null,{"$f":"BD5*19%","v":56118066.791299999}]
[null,null,null,null,null,null,null,null,null,null,null,null,null,null,null,null,null,null,null,null,null,null,null,null,null,null,null,null,null,null,null,null,{"$f":"AG5=AG6","v":true},{"$f":"AH5=AH6","v":false},false,false,false,false,false,false,false,false,false,false,false,false,false,false,false,false,false,false,null,null,null,{"$f":"SUM(BD5:BD6)","v":351476313.06129998}]

{"sheet":"Servicios","index":6,"n_rows":211,"n_cols":23,"rows_kept":211,"cut":false,"hidden":true,"merged":[]}
["concatenar","Código (Colombia Compra Eficiente)","Categoría","Subcategoría","Nombre del servicio","Modalidad de entrega del servicio","Nombre software / manejador","Unidad de facturación","UnidadTVEC","Exento de IVA","Moneda","Columna Disponible 1","Columna Disponible 2","Itera","Colsof","Soluciones Orion","UT Eforcers Xertica","Información localizada","COEM","Colombia Telecomunicaciones","IFX","CenturyLink","Hightech"]
[{"$f":"SUBSTITUTE(C2&D2&E2&F2&G2&H2,\" \",\"\")","v":"ComplementariosComplementariosExpertosExpertoJuniorenRecuperacionanteDesastresN/AN/AHORA"},"IT-NPU-CO-EX-01","Complementarios","Complementarios Expertos","Experto Junior en Recuperacion ante Desastres","N/A","N/A","HORA",null,"NO","Peso Colombiano",null,null,86671.2,149767.83360000001,113498,478395.61769999994,251153.87698940001,107307.20000000001,105525.00000000001,155801.80000000002,83833.75,185724]
[{"$f":"SUBSTITUTE(C3&D3&E3&F3&G3&H3,\" \",\"\")","v":"ComplementariosComplementariosExpertosExpertoSeniorenRecuperacionanteDesastresN/AN/AHORA"},"IT-NPU-CO-EX-02","Complementarios","Complementarios Expertos","Experto Senior en Recuperacion ante Desastres","N/A","N/A","HORA",null,"NO","Peso Colombiano",null,null,166222.98000000001,239971.91680000001,153738.20000000001,545785.57110000006,331881.90898940002,176093.86670106,205187.5,163024.4,209584.375,288904]
["ComplementariosComplementariosExpertosExpertoJuniorenBackupyArchivadoN/AN/AHORA","IT-NPU-CO-EX-03","Complementarios","Complementarios Expertos","Experto Junior en Backup y Archivado","N/A","N/A","HORA",null,"NO","Peso Colombiano",null,null,86671.2,95832.552200000006,92862,309859.85800000001,251153.87698940001,107307.20000000001,105525.00000000001,123816,50300.25,185724]
["ComplementariosComplementariosExpertosExpertoSeniorenBackupyArchivadoN/AN/AHORA","IT-NPU-CO-EX-04","Complementarios","Complementarios Expertos","Experto Senior en Backup y Archivado","N/A","N/A","HORA",null,"NO","Peso Colombiano",null,null,166222.98000000001,160554.2708,143420.20000000001,580972.01470000006,331881.90898940002,176093.86670106,205187.5,131038.6,100600.5,288904]
["ComplementariosComplementariosExpertosExpertoJuniorenSeguridadenlaNubeN/AN/AHORA","IT-NPU-CO-EX-05","Complementarios","Complementarios Expertos","Experto Junior en Seguridad en la Nube","N/A","N/A","HORA",null,"NO","Peso Colombiano",null,null,86671.2,203702.08320000002,123816,309859.85800000001,251153.87698940001,176093.86670106,105525.00000000001,139293,67067,185724]
["ComplementariosComplementariosExpertosExpertoSeniorenSeguridadenlaNubeN/AN/AHORA","IT-NPU-CO-EX-06","Complementarios","Complementarios Expertos","Experto Senior en Seguridad en la Nube","N/A","N/A","HORA",null,"NO","Peso Colombiano",null,null,166222.98000000001,260920.55220000001,164056.20000000001,580972.01470000006,331881.90898940002,203608.53340212003,205187.5,145483.80000000002,117367.25,288904]
["ComplementariosComplementariosExpertosExpertoJuniorenMigracionN/AN/AHORA","IT-NPU-CO-EX-07","Complementarios","Complementarios Expertos","Experto Junior en Migracion","N/A","N/A","HORA",null,"NO","Peso Colombiano",null,null,86671.2,138980.3646,113498,416180.14129999996,219759.6430106,107307.20000000001,105525.00000000001,123816,67067,185724]
["ComplementariosComplementariosExpertosExpertoSeniorenMigracionN/AN/AHORA","IT-NPU-CO-EX-08","Complementarios","Complementarios Expertos","Experto Senior en Migracion","N/A","N/A","HORA",null,"NO","Peso Colombiano",null,null,166222.98000000001,182128.177,153738.20000000001,478395.61769999994,287033.00301060005,176093.86670106,205187.5,131038.6,167667.5,288904]
["ComplementariosComplementariosExpertosArquitectoJuniorenNubeHibridaN/AN/AHORA","IT-NPU-CO-EX-09","Complementarios","Complementarios Expertos","Arquitecto Junior en Nube Hibrida","N/A","N/A","HORA",null,"NO","Peso Colombiano",null,null,86671.2,138980.3646,123816,446679.11749999999,219759.6430106,176093.86670106,105525.00000000001,155801.80000000002,67067,247632]
{"$rows_left_out":202}
{"sheet":"Cuadro Totales","index":7,"n_rows":12,"n_cols":9,"rows_kept":12,"cut":false,"hidden":true,"merged":[[0,0,0,5],[7,0,7,8]]}
["Valores"]
["Valor Unitario","Precio maximo autorizado","Valor X Capacidad","Precio Total","IVA","Total"]
[]
[]
[null,null,null,"Total Servicios","IVA","Total"]
[]
[]
["Valores"]
["Valor Unitario","Precio maximo autorizado","Descuento adicional","Precio con Descuento","Valor X Capacidad","Precio Total","Incluir IVA","IVA","Total"]
[]
{"$rows_left_out":3}
{"sheet":"ListaProveedores","index":8,"n_rows":8,"n_cols":1,"rows_kept":8,"cut":false,"hidden":true,"merged":[]}
["ProveedorServicios"]
["Avanxo - Segm 1. Amazon"]
["UT Goldsvada - Segm 1. Amazon"]
["Hightech - Segm 1. Amazon"]
["S3 SAS - Segm 1. Amazon"]
["UT Gestion integral cloud - Segm 1. Amazon"]
["UT Nubepublica2019 - Segm 1. Amazon"]
["Clouxter - Segm 1. Amazon"]

{"sheet":"tempProveedores","index":9,"n_rows":7,"n_cols":1,"rows_kept":7,"cut":false,"hidden":true,"merged":[]}
["Avanxo - Segm 1. Amazon"]
["UT Goldsvada - Segm 1. Amazon"]
["Hightech - Segm 1. Amazon"]
["S3 SAS - Segm 1. Amazon"]
["UT Gestion integral cloud - Segm 1. Amazon"]
["UT Nubepublica2019 - Segm 1. Amazon"]
["Clouxter - Segm 1. Amazon"]

{"sheet":"ListasAutomaticas","index":10,"n_rows":178,"n_cols":1,"rows_kept":178,"cut":false,"hidden":true,"merged":[]}
["codservicio"]
["CO-AD-01-01"]
["CO-AD-01-02"]
["CO-AD-01-03"]
["CO-AD-01-04"]
["CO-AD-02-01"]
["CO-AD-02-02"]
["CO-AD-02-03"]
["CO-AD-02-04"]
["CO-EX-01-01"]
{"$rows_left_out":169}
{"sheet":"Parametros","index":11,"n_rows":1,"n_cols":2,"rows_kept":1,"cut":false,"hidden":true,"merged":[]}
["Limite de filas",240]

{"sheet":"CSV","index":12,"n_rows":5,"n_cols":8,"rows_kept":5,"cut":false,"hidden":true,"merged":[]}
["Tipo (servicio o artÃ­culo)","Cantidad","CÃ³digo de unidad de medida*","PosiciÃ³n","Precio base","Divisa","DescripciÃ³n","MercancÃ­a"]
["item",1,"Und",null,"\"295151100,9328\"","COP","npu03--CO-NP-01 - Servicios en la Nube-NA_NA-NA - 1 Unidad"]
["item",1,"Und",null,"\"35418132,1119\"","COP","npu03--CO-GE-01 - Tasa de intermediaciÃ³n para servicios autogestionados-Servicio de ComputaciÃ³n en la Nube_NA-NA - 1 Tasa"]
["item",2,"Hora",null,"\"103572,6141\"","COP","npu03--CO-MI-01 - Servicio de PreparaciÃ³n para la migraciÃ³n-Servicios de migraciÃ³n_NA-NA - 1 Precio por hora"]
["item",1,"Und",null,"\"6768802,69\"","COP","npu03--IVA"]